program: Orca
programVersion: 5.0.2
elementType: Cl Cl O O N C C C C C C C C C C C C C C C C H H H H H H H H H H H H H H H H H H H H H
charge: 0
multiplicity: 1
keywords: wb97x-d3
keywords: def2-TZVPP
keywords: def2/J RIJCOSX
keywords: DEFGRID2
keywords: scfconv7
keywords: smallprint printgap noloewdin
keywords: NOSOSCF
formula: C16H21Cl2NO2
InChI: InChI=1/C16H21Cl2NO2/c1-12-5-2-3-8-19(12)9-4-10-21-16(20)13-6-7-14(17)15(18)11-13/h6-7,11-12H,2-5,8-10H2,1H3
42 atoms
Cl 3.643418 0.230661 -1.411917
Cl 4.093942 1.059055 1.58833
O  -1.668775 -2.128541 0.930937
O  -0.983338 -2.299588 -1.194041
N  -2.59254 0.470542 -0.209461
C  -2.198923 1.571129 0.667911
C  -0.877731 2.174527 0.187084
C  -2.696925 0.848912 -1.60694
C  -0.92903 2.593329 -1.276019
C  -1.388753 1.420215 -2.128776
C  -3.769878 -0.23936 0.257402
C  -3.271163 2.65143 0.858159
C  -3.823644 -1.696019 -0.201007
C  -2.957388 -2.646983 0.611889
C  -0.812935 -1.932851 -0.06205
C  0.413239 -1.229316 0.398977
C  1.364692 -0.901484 -0.556952
C  0.618416 -0.864101 1.725339
C  2.498729 -0.192128 -0.203653
C  1.757779 -0.167729 2.083169
C  2.698023 0.177784 1.123723
H  -2.010893 1.121642 1.650018
H  -0.086046 1.434373 0.314846
H  -0.616493 3.023041 0.824252
H  -3.512984 1.572868 -1.78135
H  -2.951088 -0.03748 -2.190841
H  0.054127 2.941824 -1.599247
H  -1.612037 3.438154 -1.409764
H  -1.514891 1.720384 -3.17132
H  -0.631496 0.632473 -2.112972
H  -3.779614 -0.210948 1.351809
H  -4.697875 0.261564 -0.061955
H  -4.196274 2.239826 1.26349
H  -2.921933 3.409135 1.560951
H  -3.522384 3.162938 -0.071601
H  -4.85179 -2.056206 -0.101494
H  -3.58345 -1.775082 -1.260788
H  -2.864321 -3.610185 0.103974
H  -3.412338 -2.826204 1.586569
H  1.210984 -1.189521 -1.587859
H  -0.109684 -1.110763 2.483844
H  1.921651 0.121106 3.11193
totalener: -1748.06693646 hartree
nucrepener: 2103.92354460 hartree
electener: -3851.99048106 hartree
oneelecener: -6580.14849560 hartree
twoeener: 2728.15801454 hartree
kineticenergy: 1743.05918493 hartree
xcener: -123.696822681284 hartree
chargesum: 0.0000000
charge: -0.043476 -0.042322 -0.266571 -0.365718 -0.156796 0.061438 -0.080588 -0.133163 -0.129432 -0.152595 -0.114899 -0.294637 -0.152249 -0.015632 0.425546 0.037065 -0.196273 -0.212270 0.085642 -0.089631 0.046524 0.049636 0.005799 0.077042 0.078784 0.098225 0.075997 0.070087 0.075539 0.079131 0.080473 0.083984 0.083841 0.086550 0.081942 0.080169 0.096153 0.105907 0.098301 0.134778 0.127911 0.119788
qa: -0.0435 -0.0423 -0.2666 -0.3657 -0.1568 0.0614 -0.0806 -0.1332 -0.1294 -0.1526 -0.1149 -0.2946 -0.1522 -0.0156 0.4255 0.0371 -0.1963 -0.2123 0.0856 -0.0896 0.0465 0.0496 0.0058 0.0770 0.0788 0.0982 0.0760 0.0701 0.0755 0.0791 0.0805 0.0840 0.0838 0.0865 0.0819 0.0802 0.0962 0.1059 0.0983 0.1348 0.1279 0.1198
va: 1.2754 1.2785 2.1091 2.1367 2.8553 3.9643 3.9188 3.9184 3.8847 3.9381 3.9260 3.9580 3.8501 3.8926 4.1948 3.5541 4.0314 4.0353 3.9208 3.9630 3.9883 1.0012 1.0566 1.0136 1.0070 1.0057 1.0149 1.0115 1.0180 1.0153 1.0002 1.0007 1.0052 1.0123 1.0033 1.0167 1.0236 1.0075 0.9951 1.0377 1.0287 1.0161
dispcorr: -0.026576358 hartree
energy: -1748.093512822252
dipole: -50.95538 49.80142 -1.15396 9.05735 -8.93309 0.12426 -2.33331 3.17743 0.84413
magnitude: 1.43514 au
magnitude: 3.64783 debye
