program: Orca
programVersion: 5.0.2
elementType: Cl Cl O O N C C C C C C C C C C C C C C C C H H H H H H H H H H H H H H H H H H H H H
charge: 0
multiplicity: 1
keywords: wb97x-d3
keywords: def2-TZVPP
keywords: def2/J RIJCOSX
keywords: DEFGRID2
keywords: scfconv7
keywords: smallprint printgap noloewdin
keywords: NOSOSCF
formula: C16H21Cl2NO2
InChI: InChI=1/C16H21Cl2NO2/c1-12-5-2-3-8-19(12)9-4-10-21-16(20)13-6-7-14(17)15(18)11-13/h6-7,11-12H,2-5,8-10H2,1H3
42 atoms
Cl 3.5823 0.946245 -0.654921
Cl 5.249705 -0.424403 1.634654
O  -0.941744 -1.586934 -0.43285
O  -0.8141 -3.197559 1.11767
N  -3.127418 0.974489 -0.65167
C  -2.22547 2.115051 -0.744914
C  -2.252786 2.659577 -2.17334
C  -4.495525 1.2650 -1.025839
C  -3.666542 2.995294 -2.633112
C  -4.572097 1.784731 -2.45258
C  -3.018659 0.219374 0.576715
C  -2.472258 3.214672 0.293498
C  -3.23876 -1.275442 0.358879
C  -2.321713 -1.867875 -0.694437
C  -0.324081 -2.282871 0.510693
C  1.063742 -1.798314 0.746529
C  1.621115 -0.759363 0.011527
C  1.810006 -2.407053 1.749952
C  2.913061 -0.334016 0.274147
C  3.095293 -1.979205 2.017526
C  3.653362 -0.941776 1.28382
H  -1.218773 1.721391 -0.566118
H  -1.833062 1.900076 -2.839115
H  -1.604786 3.53645 -2.244184
H  -4.974344 1.988358 -0.342584
H  -5.082272 0.346759 -0.944657
H  -3.656693 3.31508 -3.677238
H  -4.062002 3.839559 -2.059997
H  -5.607319 2.031134 -2.698977
H  -4.260192 0.989183 -3.135648
H  -2.018437 0.371077 0.990062
H  -3.715278 0.571933 1.353473
H  -3.447814 3.689511 0.184021
H  -2.411621 2.824501 1.310544
H  -1.717955 3.997617 0.203755
H  -3.125872 -1.801691 1.308649
H  -4.265151 -1.46762 0.032052
H  -2.51215 -1.401809 -1.658809
H  -2.476159 -2.944705 -0.783586
H  1.059542 -0.273272 -0.773295
H  1.37887 -3.215824 2.322955
H  3.676706 -2.446219 2.799837
totalener: -1748.06973698 hartree
nucrepener: 1959.74763166 hartree
electener: -3707.81736864 hartree
oneelecener: -6291.40607770 hartree
twoeener: 2583.58870906 hartree
kineticenergy: 1743.06167774 hartree
xcener: -123.690792932685 hartree
chargesum: 0.0000000
charge: -0.044396 -0.040783 -0.273375 -0.367290 -0.164629 0.081046 -0.158436 -0.128999 -0.125571 -0.135544 -0.114666 -0.290714 -0.154500 0.004226 0.453518 -0.028991 -0.178236 -0.155377 0.066057 -0.102922 0.029917 0.043887 0.074147 0.071203 0.078541 0.082912 0.074183 0.068807 0.070421 0.061962 0.082444 0.088748 0.077226 0.086663 0.088465 0.103222 0.071197 0.101084 0.110450 0.130242 0.140419 0.123442
qa: -0.0444 -0.0408 -0.2734 -0.3673 -0.1646 0.0810 -0.1584 -0.1290 -0.1256 -0.1355 -0.1147 -0.2907 -0.1545 0.0042 0.4535 -0.0290 -0.1782 -0.1554 0.0661 -0.1029 0.0299 0.0439 0.0741 0.0712 0.0785 0.0829 0.0742 0.0688 0.0704 0.0620 0.0824 0.0887 0.0772 0.0867 0.0885 0.1032 0.0712 0.1011 0.1104 0.1302 0.1404 0.1234
va: 1.2756 1.2803 2.1275 2.1375 2.8475 3.9844 3.9316 3.9474 3.8685 3.9329 3.9135 3.9456 3.8447 3.8517 4.1480 3.6966 4.0713 4.0738 3.9694 3.9737 4.0082 1.0000 1.0181 1.0141 1.0035 1.0033 1.0145 1.0103 1.0165 1.0176 1.0017 1.0037 1.0033 1.0059 1.0123 1.0280 1.0186 1.0205 1.0112 1.0349 1.0240 1.0153
dispcorr: -0.021008452 hartree
energy: -1748.090745434222
dipole: -61.37070 60.60777 -0.76293 16.72024 -16.34545 0.37479 -11.95880 11.82490 -0.13390
magnitude: 0.86050 au
magnitude: 2.18722 debye
