program: Orca
programVersion: 5.0.2
elementType: Cl Cl O O N C C C C C C C C C C C C C C C C H H H H H H H H H H H H H H H H H H H H H
charge: 0
multiplicity: 1
keywords: wb97x-d3
keywords: def2-TZVPP
keywords: def2/J RIJCOSX
keywords: DEFGRID2
keywords: scfconv7
keywords: smallprint printgap noloewdin
keywords: NOSOSCF
formula: C16H21Cl2NO2
InChI: InChI=1/C16H21Cl2NO2/c1-12-5-2-3-8-19(12)9-4-10-21-16(20)13-6-7-14(17)15(18)11-13/h6-7,11-12H,2-5,8-10H2,1H3
42 atoms
Cl 3.894408 -0.437186 2.102641
Cl 4.502951 0.694051 -0.768017
O  -1.491379 -2.126056 -0.613241
O  -1.086915 -2.11768 1.58702
N  -2.758896 0.60782 -0.835229
C  -2.583611 1.300447 0.441797
C  -1.265263 2.076749 0.417961
C  -2.741997 1.503943 -1.976596
C  -1.184437 3.043709 -0.755247
C  -1.443904 2.291959 -2.052145
C  -3.890163 -0.296817 -0.88887
C  -3.756191 2.196084 0.861666
C  -3.795957 -1.50687 0.03566
C  -2.826004 -2.586709 -0.413795
C  -0.753141 -1.877104 0.456119
C  0.55521 -1.266983 0.101994
C  1.505744 -1.147721 1.106958
C  0.833552 -0.781079 -1.171106
C  2.72923 -0.556328 0.846875
C  2.049908 -0.17702 -1.428569
C  3.002183 -0.062238 -0.425738
H  -2.475769 0.533758 1.214028
H  -0.440936 1.36268 0.349353
H  -1.142649 2.605802 1.365892
H  -3.595252 2.204891 -1.978815
H  -2.849198 0.900445 -2.881798
H  -0.204902 3.525709 -0.779931
H  -1.917202 3.848433 -0.640045
H  -1.484609 2.976842 -2.902266
H  -0.619079 1.598775 -2.239218
H  -4.846289 0.215555 -0.692386
H  -3.968227 -0.661854 -1.918187
H  -4.685566 1.634803 0.9652
H  -3.548847 2.647454 1.832623
H  -3.942946 3.008865 0.159321
H  -3.592278 -1.2132 1.066257
H  -4.781191 -1.982403 0.061152
H  -3.124605 -2.971908 -1.389629
H  -2.83498 -3.419466 0.29338
H  1.288514 -1.515543 2.10032
H  0.096134 -0.852417 -1.956771
H  2.269096 0.213692 -2.41241
totalener: -1748.06541569 hartree
nucrepener: 2058.33580798 hartree
electener: -3806.40122367 hartree
oneelecener: -6488.78501475 hartree
twoeener: 2682.38379108 hartree
kineticenergy: 1743.05803642 hartree
xcener: -123.693648366401 hartree
chargesum: -0.0000000
charge: -0.044525 -0.042356 -0.250183 -0.369421 -0.149255 0.055076 -0.146947 -0.141442 -0.124301 -0.126076 -0.116408 -0.299287 -0.150481 0.002240 0.445951 -0.029478 -0.123649 -0.237373 0.061692 -0.077568 0.040064 0.072304 0.062550 0.076572 0.078368 0.074983 0.074179 0.071830 0.076893 0.050264 0.085481 0.070860 0.086550 0.089524 0.081621 0.100010 0.083486 0.094646 0.107514 0.128302 0.134929 0.122859
qa: -0.0445 -0.0424 -0.2502 -0.3694 -0.1493 0.0551 -0.1469 -0.1414 -0.1243 -0.1261 -0.1164 -0.2993 -0.1505 0.0022 0.4460 -0.0295 -0.1236 -0.2374 0.0617 -0.0776 0.0401 0.0723 0.0625 0.0766 0.0784 0.0750 0.0742 0.0718 0.0769 0.0503 0.0855 0.0709 0.0866 0.0895 0.0816 0.1000 0.0835 0.0946 0.1075 0.1283 0.1349 0.1229
va: 1.2722 1.2785 2.1425 2.1282 2.8694 3.9242 3.9371 3.9679 3.8738 3.9146 3.9242 3.9589 3.8375 3.8815 4.1439 3.6186 4.0641 4.0447 3.9632 3.9272 4.0023 1.0031 1.0296 1.0169 1.0004 1.0039 1.0154 1.0107 1.0170 1.0241 1.0019 1.0029 1.0053 1.0114 1.0019 1.0178 1.0180 0.9977 1.0105 1.0411 1.0252 1.0146
dispcorr: -0.024880245 hartree
energy: -1748.090295934557
dipole: -55.27562 54.15817 -1.11745 13.84732 -13.69877 0.14856 -10.62301 9.66188 -0.96113
magnitude: 1.48139 au
magnitude: 3.76539 debye
