program: Orca
programVersion: 5.0.2
elementType: Cl Cl O O N C C C C C C C C C C C C C C C C H H H H H H H H H H H H H H H H H H H H H
charge: 0
multiplicity: 1
keywords: wb97x-d3
keywords: def2-TZVPP
keywords: def2/J RIJCOSX
keywords: DEFGRID2
keywords: scfconv7
keywords: smallprint printgap noloewdin
keywords: NOSOSCF
formula: C16H21Cl2NO2
InChI: InChI=1/C16H21Cl2NO2/c1-12-5-2-3-8-19(12)9-4-10-21-16(20)13-6-7-14(17)15(18)11-13/h6-7,11-12H,2-5,8-10H2,1H3
42 atoms
Cl 3.187912 1.149209 -1.193652
Cl 5.253213 -0.269625 0.704714
O  -1.17432 -1.498386 -0.310212
O  -0.83717 -2.971224 1.343352
N  -3.267578 1.028523 -0.519946
C  -2.419818 2.205114 -0.667703
C  -2.439263 2.658656 -2.127372
C  -4.639118 1.231846 -0.937909
C  -3.855294 2.901054 -2.635047
C  -4.708214 1.663328 -2.395025
C  -3.147428 0.369626 0.761341
C  -2.743468 3.352533 0.295678
C  -3.388137 -1.135809 0.678032
C  -2.566186 -1.817709 -0.399597
C  -0.435528 -2.117673 0.598448
C  0.97174 -1.632758 0.592741
C  1.386815 -0.586134 -0.221527
C  1.886793 -2.24763 1.44043
C  2.702716 -0.156232 -0.187612
C  3.201253 -1.82497 1.469242
C  3.616869 -0.779379 0.656593
H  -1.399375 1.873939 -0.444474
H  -1.971458 1.87935 -2.735878
H  -1.828439 3.557623 -2.239019
H  -5.166801 1.96904 -0.307634
H  -5.184417 0.292862 -0.816635
H  -3.836902 3.154295 -3.697241
H  -4.300764 3.760982 -2.125246
H  -5.748095 1.846293 -2.67454
H  -4.346311 0.843891 -3.023001
H  -2.135544 0.54011 1.137326
H  -3.822105 0.791353 1.52344
H  -3.743415 3.760765 0.146717
H  -2.673974 3.031671 1.335956
H  -2.034674 4.171065 0.163706
H  -3.190134 -1.583538 1.653704
H  -4.438885 -1.349763 0.461358
H  -2.859913 -1.454941 -1.382088
H  -2.706764 -2.899638 -0.366423
H  0.692053 -0.094865 -0.887558
H  1.565589 -3.060448 2.076606
H  3.916162 -2.303739 2.123451
totalener: -1748.06960514 hartree
nucrepener: 1966.89910027 hartree
electener: -3714.96870541 hartree
oneelecener: -6305.72070405 hartree
twoeener: 2590.75199864 hartree
kineticenergy: 1743.06096630 hartree
xcener: -123.690941526161 hartree
chargesum: 0.0000000
charge: -0.043863 -0.040651 -0.266428 -0.367031 -0.157940 0.081054 -0.158347 -0.137285 -0.124367 -0.133278 -0.120411 -0.294286 -0.159652 0.000470 0.447247 -0.025903 -0.176988 -0.155323 0.063293 -0.103524 0.029637 0.042900 0.074888 0.071531 0.079942 0.084563 0.074619 0.068106 0.070763 0.062961 0.087259 0.086484 0.077974 0.087358 0.088664 0.104435 0.073176 0.102199 0.109896 0.133052 0.139258 0.123548
qa: -0.0439 -0.0407 -0.2664 -0.3670 -0.1579 0.0811 -0.1583 -0.1373 -0.1244 -0.1333 -0.1204 -0.2943 -0.1597 0.0005 0.4472 -0.0259 -0.1770 -0.1553 0.0633 -0.1035 0.0296 0.0429 0.0749 0.0715 0.0799 0.0846 0.0746 0.0681 0.0708 0.0630 0.0873 0.0865 0.0780 0.0874 0.0887 0.1044 0.0732 0.1022 0.1099 0.1331 0.1393 0.1235
va: 1.2768 1.2804 2.1307 2.1378 2.8419 3.9790 3.9315 3.9485 3.8697 3.9327 3.9229 3.9496 3.8325 3.8734 4.1540 3.6929 4.0646 4.0749 3.9764 3.9722 4.0090 0.9992 1.0184 1.0137 1.0045 1.0020 1.0146 1.0102 1.0165 1.0170 0.9983 1.0043 1.0032 1.0053 1.0120 1.0262 1.0150 1.0146 1.0112 1.0307 1.0241 1.0150
dispcorr: -0.021202069 hartree
energy: -1748.090807205049
dipole: -61.45142 60.66647 -0.78495 15.39884 -15.08093 0.31791 -5.93396 5.81219 -0.12177
magnitude: 0.85559 au
magnitude: 2.17475 debye
