program: Orca
programVersion: 5.0.2
elementType: Cl Cl O O N C C C C C C C C C C C C C C C C H H H H H H H H H H H H H H H H H H H H H
charge: 0
multiplicity: 1
keywords: wb97x-d3
keywords: def2-TZVPP
keywords: def2/J RIJCOSX
keywords: DEFGRID2
keywords: scfconv7
keywords: smallprint printgap noloewdin
keywords: NOSOSCF
formula: C16H21Cl2NO2
InChI: InChI=1/C16H21Cl2NO2/c1-12-5-2-3-8-19(12)9-4-10-21-16(20)13-6-7-14(17)15(18)11-13/h6-7,11-12H,2-5,8-10H2,1H3
42 atoms
Cl 2.901705 -0.277462 -2.157782
Cl 4.55699 0.607687 0.365934
O  -1.400563 -2.27662 -0.030032
O  -1.478842 -1.664172 2.120468
N  -2.413696 0.493071 -0.617296
C  -2.739513 1.324626 0.543436
C  -1.506252 2.137315 0.940834
C  -1.93863 1.260407 -1.75636
C  -0.985771 2.98994 -0.207894
C  -0.719529 2.102407 -1.414122
C  -3.460038 -0.430776 -1.015068
C  -3.976439 2.216677 0.378629
C  -3.757063 -1.533467 -0.00105
C  -2.76573 -2.686658 -0.013431
C  -0.907402 -1.715712 1.062791
C  0.460093 -1.174075 0.851398
C  1.00456 -1.029824 -0.416995
C  1.188743 -0.766117 1.96297
C  2.265065 -0.478798 -0.574725
C  2.45052 -0.225776 1.808229
C  2.994268 -0.076796 0.540135
H  -2.942061 0.648832 1.377829
H  -0.72165 1.445564 1.258283
H  -1.748587 2.756642 1.807614
H  -2.723934 1.909859 -2.181832
H  -1.673514 0.554913 -2.548755
H  -0.074366 3.512071 0.090661
H  -1.712082 3.766301 -0.467543
H  -0.438078 2.697065 -2.286025
H  0.122054 1.440951 -1.196267
H  -4.40113 0.087835 -1.258138
H  -3.143294 -0.899974 -1.95216
H  -4.130176 2.806201 1.283411
H  -3.89333 2.916178 -0.453779
H  -4.884802 1.633294 0.224419
H  -3.863637 -1.129717 1.00541
H  -4.730132 -1.96907 -0.245592
H  -2.876457 -3.261166 -0.933584
H  -2.950106 -3.35975 0.827338
H  0.446345 -1.326527 -1.292862
H  0.762041 -0.869315 2.950877
H  3.021969 0.089392 2.669955
totalener: -1748.06585060 hartree
nucrepener: 2097.50364397 hartree
electener: -3845.56949458 hartree
oneelecener: -6567.26979266 hartree
twoeener: 2721.70029808 hartree
kineticenergy: 1743.05873204 hartree
xcener: -123.695769442565 hartree
chargesum: -0.0000000
charge: -0.049726 -0.041976 -0.260277 -0.368498 -0.159330 0.053116 -0.145764 -0.156998 -0.125364 -0.103684 -0.123911 -0.299926 -0.150864 -0.004759 0.457465 -0.033183 -0.220316 -0.140758 0.083886 -0.101662 0.042833 0.081489 0.064370 0.074813 0.083215 0.079371 0.073899 0.070811 0.078277 0.047499 0.087462 0.077715 0.088481 0.080917 0.084964 0.101848 0.083530 0.099430 0.105541 0.125450 0.137074 0.123538
qa: -0.0497 -0.0420 -0.2603 -0.3685 -0.1593 0.0531 -0.1458 -0.1570 -0.1254 -0.1037 -0.1239 -0.2999 -0.1509 -0.0048 0.4575 -0.0332 -0.2203 -0.1408 0.0839 -0.1017 0.0428 0.0815 0.0644 0.0748 0.0832 0.0794 0.0739 0.0708 0.0783 0.0475 0.0875 0.0777 0.0885 0.0809 0.0850 0.1018 0.0835 0.0994 0.1055 0.1254 0.1371 0.1235
va: 1.2677 1.2795 2.1324 2.1294 2.8622 3.9175 3.9479 3.9576 3.8745 3.9186 3.9174 3.9567 3.8357 3.8842 4.1473 3.5724 4.0455 3.9996 3.8911 3.9801 4.0056 1.0028 1.0273 1.0157 1.0019 1.0031 1.0143 1.0100 1.0161 1.0280 1.0014 1.0040 1.0113 1.0024 1.0049 1.0173 1.0166 0.9951 1.0088 1.0400 1.0260 1.0144
dispcorr: -0.026161978 hartree
energy: -1748.092012580870
dipole: -49.61965 48.80656 -0.81309 12.52699 -12.55382 -0.02684 1.59436 -1.82555 -0.23118
magnitude: 0.84574 au
magnitude: 2.14971 debye
