program: Orca
programVersion: 5.0.2
elementType: Cl Cl O O N C C C C C C C C C C C C C C C C H H H H H H H H H H H H H H H H H H H H H
charge: 0
multiplicity: 1
keywords: wb97x-d3
keywords: def2-TZVPP
keywords: def2/J RIJCOSX
keywords: DEFGRID2
keywords: scfconv7
keywords: smallprint printgap noloewdin
keywords: NOSOSCF
formula: C16H21Cl2NO2
InChI: InChI=1/C16H21Cl2NO2/c1-12-5-2-3-8-19(12)9-4-10-21-16(20)13-6-7-14(17)15(18)11-13/h6-7,11-12H,2-5,8-10H2,1H3
42 atoms
Cl 5.090133 -2.113374 -1.501753
Cl 6.067961 -1.504194 1.42556
O  -0.531848 -1.020577 1.06034
O  -0.128833 -1.451778 -1.100428
N  -4.192933 1.986053 -0.203129
C  -5.512202 2.389982 0.268898
C  -5.689392 3.889891 0.030467
C  -3.963584 2.269761 -1.606427
C  -5.463284 4.269666 -1.427698
C  -4.106968 3.756913 -1.89191
C  -3.813104 0.645727 0.182986
C  -6.67826 1.573991 -0.300977
C  -2.302807 0.502923 0.349197
C  -1.935451 -0.891538 0.820096
C  0.258026 -1.278238 0.02425
C  1.691915 -1.329393 0.417695
C  2.618341 -1.647663 -0.566995
C  2.128697 -1.066648 1.712418
C  3.967576 -1.708617 -0.267475
C  3.476892 -1.121859 2.011921
C  4.401447 -1.442228 1.028566
H  -5.509908 2.233859 1.353622
H  -4.966764 4.423819 0.653638
H  -6.684171 4.197825 0.361785
H  -4.640128 1.699521 -2.266957
H  -2.952717 1.952332 -1.869081
H  -5.525218 5.353358 -1.547382
H  -6.253169 3.848507 -2.056952
H  -3.966354 3.938639 -2.959745
H  -3.312679 4.294561 -1.366797
H  -4.288748 0.42412 1.143883
H  -4.180736 -0.119733 -0.52156
H  -7.618611 1.890577 0.152316
H  -6.784308 1.684202 -1.380283
H  -6.561772 0.509605 -0.091861
H  -1.796028 0.709909 -0.595157
H  -1.959158 1.245457 1.072223
H  -2.26672 -1.647557 0.104954
H  -2.402023 -1.108716 1.781924
H  2.283808 -1.850309 -1.575029
H  1.425017 -0.815269 2.492227
H  3.822346 -0.915897 3.015201
totalener: -1748.06869017 hartree
nucrepener: 1837.84448101 hartree
electener: -3585.91317118 hartree
oneelecener: -6047.55575374 hartree
twoeener: 2461.64258256 hartree
kineticenergy: 1743.05002686 hartree
xcener: -123.687420380653 hartree
chargesum: -0.0000000
charge: -0.042744 -0.040255 -0.272751 -0.371493 -0.155292 0.075877 -0.149600 -0.128081 -0.134436 -0.127892 -0.141867 -0.293930 -0.087743 0.001158 0.469562 -0.038439 -0.146570 -0.184557 0.058684 -0.103539 0.043703 0.050870 0.073304 0.067547 0.078713 0.088738 0.073086 0.069271 0.069059 0.063800 0.075251 0.076806 0.086630 0.078619 0.085597 0.082933 0.064394 0.096810 0.101537 0.132088 0.133947 0.121205
qa: -0.0427 -0.0403 -0.2728 -0.3715 -0.1553 0.0759 -0.1496 -0.1281 -0.1344 -0.1279 -0.1419 -0.2939 -0.0877 0.0012 0.4696 -0.0384 -0.1466 -0.1846 0.0587 -0.1035 0.0437 0.0509 0.0733 0.0675 0.0787 0.0887 0.0731 0.0693 0.0691 0.0638 0.0753 0.0768 0.0866 0.0786 0.0856 0.0829 0.0644 0.0968 0.1015 0.1321 0.1339 0.1212
va: 1.2740 1.2807 2.1461 2.1318 2.9324 3.9854 3.9123 3.9390 3.8800 3.9216 3.9785 3.9355 3.8259 3.8689 4.1223 3.7144 4.0912 4.0696 3.9662 3.9787 4.0043 1.0022 1.0219 1.0135 1.0043 1.0047 1.0145 1.0099 1.0163 1.0201 0.9996 0.9962 1.0122 1.0033 1.0055 1.0331 1.0330 1.0151 1.0009 1.0393 1.0242 1.0160
dispcorr: -0.018562746 hartree
energy: -1748.087252915979
dipole: -84.57732 83.47922 -1.09811 34.90353 -34.51389 0.38964 -3.69906 4.54509 0.84603
magnitude: 1.43994 au
magnitude: 3.66003 debye
