program: Orca
programVersion: 5.0.2
elementType: Cl Cl O O N C C C C C C C C C C C C C C C C H H H H H H H H H H H H H H H H H H H H H
charge: 0
multiplicity: 1
keywords: wb97x-d3
keywords: def2-TZVPP
keywords: def2/J RIJCOSX
keywords: DEFGRID2
keywords: scfconv7
keywords: smallprint printgap noloewdin
keywords: NOSOSCF
formula: C16H21Cl2NO2
InChI: InChI=1/C16H21Cl2NO2/c1-12-5-2-3-8-19(12)9-4-10-21-16(20)13-6-7-14(17)15(18)11-13/h6-7,11-12H,2-5,8-10H2,1H3
42 atoms
Cl 4.680287 -1.21085 2.166447
Cl 5.544447 -0.484583 -0.770327
O  -0.950243 -1.794656 -0.540886
O  -0.489851 -2.099484 1.629015
N  -3.855282 1.458295 -0.417867
C  -4.353633 2.257395 -1.532186
C  -5.423921 3.220892 -1.01846
C  -3.296283 2.249619 0.661543
C  -4.910133 4.092758 0.12053
C  -4.329611 3.215997 1.221848
C  -3.00447 0.358265 -0.820385
C  -3.272521 2.981841 -2.342865
C  -3.095505 -0.820973 0.144366
C  -2.34374 -2.049463 -0.331029
C  -0.141514 -1.827217 0.511706
C  1.261575 -1.492689 0.147388
C  2.209969 -1.503786 1.162265
C  1.647515 -1.167558 -1.149089
C  3.530625 -1.193992 0.891722
C  2.967202 -0.859604 -1.421333
C  3.914032 -0.87067 -0.407324
H  -4.849947 1.556298 -2.212564
H  -6.273036 2.631993 -0.660956
H  -5.789095 3.83644 -1.844208
H  -2.395759 2.808095 0.3511
H  -2.970281 1.57707 1.457407
H  -5.718154 4.714544 0.511578
H  -4.144173 4.783882 -0.24392
H  -3.872063 3.825282 2.004433
H  -5.131477 2.639281 1.690833
H  -3.337622 0.016396 -1.805836
H  -1.953929 0.66426 -0.945013
H  -2.535548 2.28395 -2.742812
H  -3.720281 3.499333 -3.192474
H  -2.731778 3.726068 -1.757929
H  -2.751753 -0.548104 1.143733
H  -4.147053 -1.100422 0.248375
H  -2.710883 -2.371243 -1.306594
H  -2.473146 -2.875728 0.370003
H  1.914923 -1.755116 2.171681
H  0.925437 -1.151957 -1.952268
H  3.272776 -0.606978 -2.426899
totalener: -1748.06859043 hartree
nucrepener: 1889.47600627 hartree
electener: -3637.54459670 hartree
oneelecener: -6150.79068102 hartree
twoeener: 2513.24608432 hartree
kineticenergy: 1743.04703237 hartree
xcener: -123.686497606103 hartree
chargesum: -0.0000000
charge: -0.042288 -0.039944 -0.275062 -0.367878 -0.152484 0.077769 -0.149903 -0.129793 -0.135877 -0.129552 -0.110578 -0.293509 -0.121158 -0.018493 0.469379 -0.033523 -0.146215 -0.187707 0.059391 -0.103243 0.043068 0.050480 0.073291 0.068806 0.077521 0.089017 0.073892 0.068809 0.069514 0.064451 0.068837 0.078899 0.084073 0.085889 0.078974 0.085751 0.072953 0.098294 0.110466 0.132220 0.134436 0.121022
qa: -0.0423 -0.0399 -0.2751 -0.3679 -0.1525 0.0778 -0.1499 -0.1298 -0.1359 -0.1296 -0.1106 -0.2935 -0.1212 -0.0185 0.4694 -0.0335 -0.1462 -0.1877 0.0594 -0.1032 0.0431 0.0505 0.0733 0.0688 0.0775 0.0890 0.0739 0.0688 0.0695 0.0645 0.0688 0.0789 0.0841 0.0859 0.0790 0.0858 0.0730 0.0983 0.1105 0.1322 0.1344 0.1210
va: 1.2745 1.2811 2.1191 2.1364 2.9292 3.9849 3.9106 3.9423 3.8817 3.9223 3.9258 3.9353 3.8200 3.8941 4.1297 3.6992 4.0939 4.0674 3.9660 3.9833 4.0048 1.0021 1.0220 1.0133 1.0041 1.0026 1.0141 1.0099 1.0162 1.0197 1.0018 1.0061 1.0057 1.0126 1.0028 1.0316 1.0339 0.9962 1.0139 1.0392 1.0234 1.0159
dispcorr: -0.019301744 hartree
energy: -1748.087892173976
dipole: -71.34716 70.52869 -0.81847 28.35195 -28.04277 0.30919 -12.30528 11.22626 -1.07903
magnitude: 1.38917 au
magnitude: 3.53099 debye
