program: Orca
programVersion: 4.2.1
elementType: Cl Cl N N N C C C C C C C C C C C C C H H H H H H H H H H H H H H H
charge: 0
multiplicity: 1
keywords: wb97x-d3
keywords: def2-TZVPP
keywords: def2/J RIJCOSX GRIDX6 NOFINALGRIDX
keywords: grid4 nofinalgrid
keywords: scfconv7
keywords: smallprint printgap noloewdin
keywords: NOSOSCF
formula: C13H15Cl2N3
InChI: InChI=1/C13H15Cl2N3/c1-2-3-10(7-18-9-16-8-17-18)12-5-4-11(14)6-13(12)15/h4-6,8-10H,2-3,7H2,1H3
33 atoms
Cl -0.372811 -0.187418 2.378333
Cl 3.958287 1.498461 -0.247805
N  -1.139373 -2.176049 -0.748332
N  -0.002711 -2.399314 -1.412563
N  -0.057233 -3.612346 0.474527
C  -1.921953 0.135896 -0.320668
C  -2.846698 1.213433 -0.894522
C  -2.072793 -1.146996 -1.15179
C  -0.464723 0.522105 -0.254671
C  -3.12183 2.396568 0.028633
C  0.318767 0.369084 0.885477
C  0.183986 0.986498 -1.397048
C  -1.934665 3.307787 0.308295
C  1.674583 0.665947 0.904215
C  1.531515 1.294267 -1.415939
C  -1.148914 -2.89273 0.374633
C  2.26836 1.127388 -0.255014
C  0.604647 -3.265445 -0.644394
H  -2.278477 -0.089793 0.686387
H  -2.464973 1.5719 -1.855005
H  -3.803748 0.733581 -1.118864
H  -1.901981 -0.953565 -2.209759
H  -3.085665 -1.53481 -1.047914
H  -3.9180 2.990351 -0.427031
H  -3.529659 2.026066 0.973789
H  -0.379917 1.11044 -2.31291
H  -1.462836 3.643905 -0.616943
H  -1.167058 2.821461 0.909768
H  -2.255584 4.196091 0.854225
H  2.251317 0.538234 1.809472
H  1.996814 1.653843 -2.322889
H  -1.96889 -2.876134 1.074806
H  1.568094 -3.672597 -0.908315
elementType: Cl N C H
totalener: -1589.15363812 hartree
nucrepener: 1609.28014273 hartree
electener: -3198.43378085 hartree
oneelecener: -5375.81161665 hartree
twoeener: 2177.37783580 hartree
cpcmener: -0.02542893 hartree
kineticenergy: 1584.92739813 hartree
xcener: -108.652037810991 hartree
chargesum: -0.0000000
charge: -0.091991 -0.092107 0.116819 -0.336135 -0.408277 0.109039 -0.168334 -0.095162 -0.017027 -0.109946 0.007051 -0.183969 -0.272426 -0.112827 -0.162844 0.025691 0.094095 0.049372 0.081606 0.083288 0.085284 0.121288 0.132028 0.075323 0.056400 0.138605 0.081162 0.079101 0.100456 0.122330 0.148575 0.181851 0.161682
qa: -0.0920 -0.0921 0.1168 -0.3361 -0.4083 0.1090 -0.1683 -0.0952 -0.0170 -0.1099 0.0071 -0.1840 -0.2724 -0.1128 -0.1628 0.0257 0.0941 0.0494 0.0816 0.0833 0.0853 0.1213 0.1320 0.0753 0.0564 0.1386 0.0812 0.0791 0.1005 0.1223 0.1486 0.1819 0.1617
va: 1.2266 1.2117 3.3703 2.8888 3.0159 3.7111 3.9495 3.8633 3.4462 3.8861 3.8544 3.9381 3.9407 4.0521 4.0423 4.0671 3.8469 4.0553 1.0346 1.0069 1.0088 1.0064 1.0029 1.0043 1.0096 1.0050 1.0040 0.9954 1.0049 1.0204 1.0015 0.9935 0.9966
dispcorr: -0.019418104 hartree
energy: -1589.173056225605
dipole: -26.01550 23.77608 -2.23942 9.57564 -8.41872 1.15692 -8.94999 8.10806 -0.84193
magnitude: 2.65750 au
magnitude: 6.75484 debye
