program: Orca
programVersion: 4.2.1
elementType: Cl Cl N N N C C C C C C C C C C C C C H H H H H H H H H H H H H H H
charge: 0
multiplicity: 1
keywords: wb97x-d3
keywords: def2-TZVPP
keywords: def2/J RIJCOSX GRIDX6 NOFINALGRIDX
keywords: grid4 nofinalgrid
keywords: scfconv7
keywords: smallprint printgap noloewdin
keywords: NOSOSCF
formula: C13H15Cl2N3
InChI: InChI=1/C13H15Cl2N3/c1-2-3-10(7-18-9-16-8-17-18)12-5-4-11(14)6-13(12)15/h4-6,8-10H,2-3,7H2,1H3
33 atoms
Cl -0.06027 0.413277 2.823438
Cl 4.118766 1.605435 -0.281598
N  -1.341452 -2.197948 -0.872437
N  -1.287638 -3.026899 0.171653
N  0.136502 -3.691674 -1.430473
C  -1.676089 -0.023003 0.237509
C  -2.598889 1.203406 0.313091
C  -2.140152 -0.993453 -0.847482
C  -0.224974 0.369183 0.106192
C  -2.619044 2.107345 -0.913119
C  0.582621 0.5900 1.221625
C  0.373385 0.566967 -1.137377
C  -3.558964 3.288884 -0.722312
C  1.913142 0.96773 1.120127
C  1.697716 0.946257 -1.277118
C  -0.483448 -2.599622 -1.808293
C  2.460173 1.139254 -0.138619
C  -0.39496 -3.902425 -0.213252
H  -1.796985 -0.555786 1.182329
H  -3.61387 0.84716 0.515965
H  -2.308911 1.793139 1.187524
H  -2.10401 -0.568372 -1.848886
H  -3.179332 -1.263108 -0.659595
H  -1.613295 2.479453 -1.123668
H  -2.930672 1.545254 -1.797791
H  -0.206177 0.434197 -2.041401
H  -3.564696 3.937766 -1.598785
H  -3.262794 3.896828 0.134915
H  -4.584913 2.957611 -0.551581
H  2.508036 1.12449 2.008981
H  2.121491 1.088212 -2.261417
H  -0.355979 -2.083405 -2.746631
H  -0.116797 -4.735373 0.413683
elementType: Cl N C H
totalener: -1589.15652056 hartree
nucrepener: 1560.42938790 hartree
electener: -3149.58590846 hartree
oneelecener: -5277.64639751 hartree
twoeener: 2128.06048905 hartree
cpcmener: -0.02594726 hartree
kineticenergy: 1584.91336124 hartree
xcener: -108.650249570021 hartree
chargesum: -0.0000000
charge: -0.087591 -0.089837 0.115799 -0.353052 -0.421760 0.128075 -0.154252 -0.162269 0.093088 -0.082598 -0.039930 -0.264864 -0.296053 -0.129051 -0.144902 0.076475 0.085405 0.064148 0.079884 0.087833 0.075929 0.124974 0.130713 0.067605 0.066189 0.163290 0.092750 0.081771 0.083834 0.123530 0.148506 0.173619 0.162742
qa: -0.0876 -0.0898 0.1158 -0.3531 -0.4218 0.1281 -0.1543 -0.1623 0.0931 -0.0826 -0.0399 -0.2649 -0.2961 -0.1291 -0.1449 0.0765 0.0854 0.0641 0.0799 0.0878 0.0759 0.1250 0.1307 0.0676 0.0662 0.1633 0.0927 0.0818 0.0838 0.1235 0.1485 0.1736 0.1627
va: 1.2379 1.2139 3.3667 2.8834 3.0244 3.6883 3.9042 3.9182 3.4009 3.8403 4.0028 3.8924 3.9583 4.0554 4.0705 4.0466 3.8697 4.0472 1.0523 1.0088 1.0151 0.9927 1.0059 1.0054 1.0073 0.9899 1.0023 0.9999 1.0001 1.0209 1.0036 0.9938 0.9948
dispcorr: -0.017191031 hartree
energy: -1589.173711587640
dipole: -29.07055 27.56021 -1.51034 7.40036 -5.98302 1.41735 -12.13215 10.91786 -1.21428
magnitude: 2.40094 au
magnitude: 6.10269 debye
