program: Gaussian 09
title: 000068416
version: EM64L-G09RevD.01
frameworkgroup: C1[X(C10H11BrN2O3)]
method: RPBEPBE
basis: SDD
operation: Freq
keyword: #p
keyword: freq=noraman
keyword: PBEPBE/SDD
title: #p freq=noraman PBEPBE/SDD
converged: YES YES NO NO
title: Mulliken charges:
elementType: Br O O O N N C C C C C C C C C C H H H H H H H H H H H
charge: 0.008827 -0.211468 -0.194680 -0.216498 -0.373747 -0.370942 0.084040 -0.539123 -0.515023 0.187284 0.174763 0.064424 -0.049084 0.157232 -0.568882 -0.581041 0.266919 0.273223 0.254557 0.226951 0.369456 0.369545 0.246002 0.252817 0.236524 0.219149 0.228774
chargesum: 0.00000
title: Mulliken charges with hydrogens summed into heavy atoms:
elementType: Br O O O N N C C C C C C C C C C
charge: 0.008827 -0.211468 -0.194680 -0.216498 -0.004291 -0.001397 0.084040 0.001020 -0.033515 0.187284 0.174763 0.064424 0.196918 0.157232 -0.079541 -0.133118
polarizability: 1.54559999e+02 2.04233421e+00 1.66117648e+02 1.53520837e+01 1.00867480e+01 1.07752224e+02
1716.lowfreq: -4.4542 -0.0008 -0.0008 -0.0006 3.2587 7.9910 25.4742 31.0039 55.8392
frequency: 25.3143 30.8182 55.8239 67.9950 90.7760 108.6647 135.4455 143.3934 157.7296 185.4207 203.5321 266.7041 329.8624 342.5160 355.6001 361.6011 379.4341 403.7459 445.7344 481.6037 492.6413 552.6309 590.2281 624.4607 634.5184 651.3920 658.9457 686.8873 725.4062 755.7032 768.9465 786.2747 836.9563 888.9243 921.5880 928.9811 942.4385 958.4203 986.3859 992.9605 1008.9945 1020.3385 1068.7784 1138.0223 1151.1572 1194.9502 1237.0889 1272.8420 1283.5504 1295.4964 1315.5767 1332.5224 1360.5057 1377.6279 1377.9861 1405.1552 1425.6208 1453.0059 1455.7940 1619.6310 1639.1564 1656.1314 1658.2270 1678.4407 3002.3184 3012.8221 3067.5768 3078.9570 3088.7752 3103.0184 3108.1625 3199.1155 3221.8115 3518.1573 3519.8833
redmass: 9.5636 6.8122 4.4491 4.2421 4.0311 5.4745 4.8932 6.7012 11.0126 3.0880 4.8794 3.4864 3.3023 3.6409 6.5910 8.5668 2.6243 3.2925 2.7678 6.7743 4.5739 4.2213 4.5552 2.7944 3.1713 1.3478 2.3792 2.5621 2.8745 1.9402 3.3257 1.7289 2.1506 1.6344 1.3717 3.0234 1.9411 1.3353 3.3970 3.2255 1.7926 1.3298 2.4220 2.9776 2.5587 3.2658 1.2724 1.5043 1.3889 1.6731 1.4571 1.8214 8.9929 1.7039 1.7404 1.1515 1.1612 1.1044 1.1135 7.1423 5.7931 8.5232 4.7309 5.5303 1.0589 1.0584 1.1031 1.0989 1.0628 1.0642 1.0950 1.1149 1.1136 1.0758 1.0782
irintensity: 0.2951 1.3787 0.0638 0.2918 0.3304 0.1208 0.4098 0.6541 13.3987 2.0328 0.2033 0.9045 2.1697 1.0025 18.4112 21.1440 3.3884 1.3993 11.8858 16.2812 7.3455 20.6070 5.6370 16.5637 11.9675 5.3879 11.4802 22.3523 19.1249 5.8581 4.4244 193.2096 11.3469 3.0029 78.6102 3.9898 1.9362 72.6256 2.3972 17.9118 2.2950 21.3000 7.6594 70.0486 17.3827 61.6126 21.6351 9.8252 37.9742 111.7897 37.7303 146.3885 224.6267 3.0603 5.6215 11.3252 7.7520 27.7557 12.6735 292.0041 57.6990 63.2801 17.9603 604.3073 4.8017 8.3724 4.7868 0.3931 7.3285 1.6762 9.5726 20.9618 3.3292 89.2568 45.5909
temp: 298.150 k
press: 1.00000 atm
elementType: 35 8 8 8 7 7 6 6 6 6 6 6 6 6 6 6 1 1 1 1 1 1 1 1 1 1 1
symmnumber: 1
zpe: 522191.5 jmol-1
zpe.correction: 0.198892 hartree
zpe.thermalcorrener: 0.215034 hartree
zpe.thermalcorrenthalpy: 0.215978 hartree
zpe.thermalcorrgfe: 0.153017 hartree
zpe.sumelectzpe: -735.114343 hartree
zpe.sumelectthermal: -735.098202 hartree
zpe.sumelectthermalent: -735.097258 hartree
zpe.sumelectthermalfe: -735.160218 hartree
dipole: -0.0527 -1.5547 -0.9967
dipole: 1.8475
quadrupole: -105.9623 -107.4984 -106.6705
quadrupole: -0.5577 -4.1273 1.6666
quadrupole: 0.7481 -0.7880 0.0399 -0.5577 -4.1273 1.6666
hfenergy: -735.3132357 hartree
pointgroup: C01 [X(C10H11Br1N2O3)]
dipole: -0.3703485 0.4721664 -0.4101759 debye
polarizability: 157.7992745|-4.8028728|162.8652893|-3.1014955|-18.3461111|107.7653071 unknown
InChI: InChI=1S/C10H11BrN2O3/c1-3-4-10(5-6(2)11)7(14)12-9(16)13-8(10)15/h3,12-13H,1-2,4-5H2
charge 0 multiplicity 1
27 atoms
Br -2.49176 -2.753114 -0.013832
O  1.120151 1.487736 -1.955171
O  -0.763149 -0.520434 2.002053
O  3.248843 -2.028629 0.218193
N  2.137612 -0.273811 -0.854472
N  1.152006 -1.35192 1.005093
C  -0.213716 0.346795 -0.233092
C  -1.168223 -0.427698 -1.25638
C  -0.853981 1.709989 0.177814
C  1.059508 0.601847 -1.065412
C  0.01711 -0.515638 1.018939
C  -2.497622 -0.900141 -0.714583
C  -0.019754 2.489604 1.177351
C  2.246078 -1.280332 0.126261
C  -3.660311 -0.20997 -0.725683
C  0.660893 3.62615 0.885743
H  -0.616033 -1.282201 -1.687672
H  -1.354163 0.292858 -2.075002
H  -1.843349 1.485824 0.61594
H  -0.993673 2.301798 -0.743945
H  2.954503 -0.163159 -1.464518
H  1.246747 -2.017786 1.779337
H  0.003023 2.08832 2.200943
H  -4.5933 -0.617809 -0.329424
H  -3.685371 0.802863 -1.146165
H  1.240498 4.157134 1.649503
H  0.659734 4.053126 -0.124721
