program: Orca
programVersion: 4.2.1
elementType: Cl Cl N N N C C C C C C C C C C C C C H H H H H H H H H H H H H H H
charge: 0
multiplicity: 1
keywords: wb97x-d3
keywords: def2-TZVPP
keywords: def2/J RIJCOSX GRIDX6 NOFINALGRIDX
keywords: grid4 nofinalgrid
keywords: scfconv7
keywords: smallprint printgap noloewdin
keywords: NOSOSCF
formula: C13H15Cl2N3
InChI: InChI=1/C13H15Cl2N3/c1-2-3-10(7-18-9-16-8-17-18)12-5-4-11(14)6-13(12)15/h4-6,8-10H,2-3,7H2,1H3
33 atoms
Cl -0.226183 -0.2841 2.430445
Cl 4.084184 1.388248 -0.240087
N  -1.180482 -2.153978 -0.759131
N  -0.072013 -2.410007 -1.458308
N  -0.141489 -3.681218 0.389046
C  -1.827249 0.169269 -0.221767
C  -2.695597 1.332431 -0.703261
C  -2.065251 -1.06161 -1.103803
C  -0.35684 0.504016 -0.178505
C  -2.609792 2.560397 0.192935
C  0.444548 0.308824 0.942416
C  0.2776 0.985259 -1.322766
C  -3.520748 3.682684 -0.278814
C  1.807016 0.577158 0.939449
C  1.630945 1.263942 -1.36247
C  -1.199867 -2.908229 0.338867
C  2.387113 1.053595 -0.220675
C  0.510886 -3.32874 -0.733498
H  -2.16358 -0.085432 0.785059
H  -2.431186 1.603672 -1.729991
H  -3.733152 0.986502 -0.741675
H  -1.900256 -0.834745 -2.155829
H  -3.096307 -1.397596 -0.996107
H  -2.870783 2.278804 1.217185
H  -1.578614 2.922103 0.228999
H  -0.302948 1.145699 -2.222402
H  -4.566169 3.369192 -0.291308
H  -3.26174 4.004562 -1.289035
H  -3.446294 4.554563 0.372012
H  2.399518 0.415049 1.828775
H  2.085318 1.635828 -2.269856
H  -2.001842 -2.877006 1.058857
H  1.446606 -3.772758 -1.034523
elementType: Cl N C H
totalener: -1589.15688313 hartree
nucrepener: 1586.50496877 hartree
electener: -3175.66185190 hartree
oneelecener: -5330.20574031 hartree
twoeener: 2154.54388841 hartree
cpcmener: -0.02565150 hartree
kineticenergy: 1584.92650146 hartree
xcener: -108.650331071808 hartree
chargesum: -0.0000000
charge: -0.090991 -0.091203 0.117796 -0.338199 -0.409195 0.117475 -0.193041 -0.099485 -0.038364 -0.065676 0.020955 -0.168699 -0.286630 -0.123470 -0.162320 0.029781 0.097480 0.050726 0.080166 0.076428 0.088485 0.118302 0.135270 0.061606 0.064437 0.140118 0.080561 0.081142 0.092103 0.123061 0.148277 0.181039 0.162064
qa: -0.0910 -0.0912 0.1178 -0.3382 -0.4092 0.1175 -0.1930 -0.0995 -0.0384 -0.0657 0.0210 -0.1687 -0.2866 -0.1235 -0.1623 0.0298 0.0975 0.0507 0.0802 0.0764 0.0885 0.1183 0.1353 0.0616 0.0644 0.1401 0.0806 0.0811 0.0921 0.1231 0.1483 0.1810 0.1621
va: 1.2294 1.2124 3.3703 2.8873 3.0150 3.7080 3.9433 3.8684 3.4791 3.8365 3.8887 3.9429 3.9541 4.0589 4.0412 4.0643 3.8421 4.0544 1.0384 1.0075 1.0099 1.0087 1.0015 1.0092 1.0087 1.0052 1.0004 0.9997 1.0031 1.0203 1.0025 0.9936 0.9965
dispcorr: -0.018169246 hartree
energy: -1589.175052371561
dipole: -29.23399 27.09789 -2.13610 11.58120 -10.31444 1.26675 -9.74878 9.03952 -0.70926
magnitude: 2.58276 au
magnitude: 6.56485 debye
