program: Orca
programVersion: 4.2.1
elementType: Cl Cl N N N C C C C C C C C C C C C C H H H H H H H H H H H H H H H
charge: 0
multiplicity: 1
keywords: wb97x-d3
keywords: def2-TZVPP
keywords: def2/J RIJCOSX GRIDX6 NOFINALGRIDX
keywords: grid4 nofinalgrid
keywords: scfconv7
keywords: smallprint printgap noloewdin
keywords: NOSOSCF
formula: C13H15Cl2N3
InChI: InChI=1/C13H15Cl2N3/c1-2-3-10(7-18-9-16-8-17-18)12-5-4-11(14)6-13(12)15/h4-6,8-10H,2-3,7H2,1H3
33 atoms
Cl 0.138673 0.793775 2.959636
Cl 4.507803 0.790367 -0.116186
N  -1.413689 -1.838011 -0.322563
N  -2.008893 -2.013184 -1.504197
N  -0.170108 -3.281533 -1.363358
C  -1.511135 0.561871 0.353288
C  -2.245928 1.167995 -0.846731
C  -1.910794 -0.894069 0.65038
C  -0.007658 0.655483 0.24455
C  -3.738384 1.361857 -0.604935
C  0.819905 0.741037 1.364203
C  0.62996 0.597838 -0.993148
C  -4.431795 2.004436 -1.795976
C  2.202498 0.786373 1.270447
C  2.007783 0.635311 -1.123844
C  -0.316194 -2.594977 -0.255098
C  2.785295 0.733354 0.016644
C  -1.230657 -2.88629 -2.092936
H  -1.826695 1.12601 1.235633
H  -1.798431 2.141915 -1.064901
H  -2.107391 0.557382 -1.741134
H  -2.993725 -0.99637 0.699181
H  -1.522036 -1.197161 1.622171
H  -4.217961 0.403288 -0.392791
H  -3.885868 1.981753 0.283948
H  0.037478 0.52301 -1.89477
H  -4.361219 1.375077 -2.684602
H  -3.990372 2.971948 -2.041879
H  -5.491101 2.169664 -1.595791
H  2.810747 0.862381 2.160903
H  2.462084 0.588185 -2.103714
H  0.32849 -2.622343 0.609491
H  -1.4391 -3.256669 -3.084565
elementType: Cl N C H
totalener: -1589.16599958 hartree
nucrepener: 1563.02266072 hartree
electener: -3152.18866031 hartree
oneelecener: -5282.71309184 hartree
twoeener: 2130.52443153 hartree
cpcmener: -0.01823997 hartree
kineticenergy: 1584.89070023 hartree
xcener: -108.646042516702 hartree
chargesum: 0.0000000
charge: -0.085913 -0.087018 0.141654 -0.365336 -0.405551 0.142287 -0.162219 -0.158105 -0.019503 -0.091886 -0.008874 -0.166055 -0.292802 -0.134841 -0.167412 0.053728 0.102066 0.069953 0.074879 0.102153 0.063499 0.133703 0.134089 0.062774 0.065059 0.146001 0.082700 0.080776 0.091898 0.123244 0.145505 0.167598 0.161950
qa: -0.0859 -0.0870 0.1417 -0.3653 -0.4056 0.1423 -0.1622 -0.1581 -0.0195 -0.0919 -0.0089 -0.1661 -0.2928 -0.1348 -0.1674 0.0537 0.1021 0.0700 0.0749 0.1022 0.0635 0.1337 0.1341 0.0628 0.0651 0.1460 0.0827 0.0808 0.0919 0.1232 0.1455 0.1676 0.1620
va: 1.2430 1.2163 3.3112 2.8569 3.0276 3.7269 3.8847 3.8933 3.4945 3.8739 3.9733 3.8922 3.9518 4.0798 4.0789 4.0672 3.8626 4.0320 1.0320 1.0102 1.0340 1.0049 1.0097 1.0128 1.0061 1.0002 1.0001 1.0008 1.0039 1.0213 1.0051 0.9948 0.9946
dispcorr: -0.017603841 hartree
energy: -1589.183603424985
dipole: -32.63094 31.75075 -0.88019 4.15672 -3.25351 0.90321 -13.21922 13.88556 0.66634
magnitude: 1.42637 au
magnitude: 3.62555 debye
