program: Orca
programVersion: 4.2.1
elementType: Cl Cl N N N C C C C C C C C C C C C C H H H H H H H H H H H H H H H
charge: 0
multiplicity: 1
keywords: wb97x-d3
keywords: def2-TZVPP
keywords: def2/J RIJCOSX GRIDX6 NOFINALGRIDX
keywords: grid4 nofinalgrid
keywords: scfconv7
keywords: smallprint printgap noloewdin
keywords: NOSOSCF
formula: C13H15Cl2N3
InChI: InChI=1/C13H15Cl2N3/c1-2-3-10(7-18-9-16-8-17-18)12-5-4-11(14)6-13(12)15/h4-6,8-10H,2-3,7H2,1H3
33 atoms
Cl -0.058695 0.388452 2.818424
Cl 4.119419 1.612639 -0.27817
N  -1.317041 -2.195193 -0.873572
N  -1.259207 -2.995745 0.190126
N  0.109522 -3.736311 -1.418634
C  -1.676464 -0.022693 0.225068
C  -2.607521 1.198033 0.303193
C  -2.125436 -0.996775 -0.863691
C  -0.226048 0.375662 0.1006
C  -2.625328 2.116076 -0.912445
C  0.582054 0.584806 1.217792
C  0.371632 0.588451 -1.140818
C  -3.55698 3.301699 -0.707539
C  1.913008 0.962449 1.118405
C  1.695653 0.968484 -1.278048
C  -0.492757 -2.642758 -1.821902
C  2.459923 1.147141 -0.13839
C  -0.392931 -3.904278 -0.181056
H  -1.797804 -0.560218 1.167388
H  -3.621832 0.834066 0.49649
H  -2.326984 1.779967 1.185948
H  -2.08347 -0.572466 -1.865661
H  -3.163996 -1.276949 -0.682667
H  -1.618118 2.486752 -1.119584
H  -2.941071 1.566222 -1.803837
H  -0.208718 0.464624 -2.045598
H  -3.560499 3.958934 -1.578209
H  -3.253577 3.900696 0.153545
H  -4.585742 2.978379 -0.536548
H  2.509131 1.10838 2.008376
H  2.118002 1.12042 -2.261576
H  -0.37367 -2.153926 -2.776233
H  -0.116948 -4.724249 0.463898
elementType: Cl N C H
totalener: -1589.16583933 hartree
nucrepener: 1559.47243657 hartree
electener: -3148.63827590 hartree
oneelecener: -5275.77851928 hartree
twoeener: 2127.14024338 hartree
cpcmener: -0.02255280 hartree
kineticenergy: 1584.88693502 hartree
xcener: -108.645404534521 hartree
chargesum: 0.0000000
charge: -0.085602 -0.087906 0.120032 -0.349801 -0.415238 0.123990 -0.151107 -0.166660 0.093848 -0.084503 -0.036496 -0.263796 -0.293450 -0.128366 -0.141333 0.074482 0.084351 0.065315 0.081676 0.086434 0.076174 0.121683 0.129413 0.068014 0.064790 0.156916 0.092197 0.081971 0.083198 0.122439 0.146053 0.170123 0.161161
qa: -0.0856 -0.0879 0.1200 -0.3498 -0.4152 0.1240 -0.1511 -0.1667 0.0938 -0.0845 -0.0365 -0.2638 -0.2934 -0.1284 -0.1413 0.0745 0.0844 0.0653 0.0817 0.0864 0.0762 0.1217 0.1294 0.0680 0.0648 0.1569 0.0922 0.0820 0.0832 0.1224 0.1461 0.1701 0.1612
va: 1.2397 1.2158 3.3596 2.8802 3.0287 3.6900 3.9009 3.9238 3.4064 3.8416 4.0054 3.8943 3.9596 4.0547 4.0699 4.0456 3.8788 4.0452 1.0533 1.0093 1.0153 0.9936 1.0058 1.0053 1.0066 0.9924 1.0024 1.0002 1.0003 1.0210 1.0042 0.9945 0.9948
dispcorr: -0.017167339 hartree
energy: -1589.183006670754
dipole: -29.10018 27.64717 -1.45301 7.45873 -6.09612 1.36261 -12.14156 10.98376 -1.15780
magnitude: 2.30401 au
magnitude: 5.85632 debye
