program: Orca
programVersion: 4.2.1
elementType: Cl Cl N N N C C C C C C C C C C C C C H H H H H H H H H H H H H H H
charge: 0
multiplicity: 1
keywords: wb97x-d3
keywords: def2-TZVPP
keywords: def2/J RIJCOSX GRIDX6 NOFINALGRIDX
keywords: grid4 nofinalgrid
keywords: scfconv7
keywords: smallprint printgap noloewdin
keywords: NOSOSCF
formula: C13H15Cl2N3
InChI: InChI=1/C13H15Cl2N3/c1-2-3-10(7-18-9-16-8-17-18)12-5-4-11(14)6-13(12)15/h4-6,8-10H,2-3,7H2,1H3
33 atoms
Cl -0.129021 -0.557322 2.270848
Cl 4.113567 1.655675 -0.098882
N  -1.154372 -2.169359 -0.803875
N  -1.671222 -2.992223 0.109791
N  0.423915 -3.60002 -0.390582
C  -1.739011 0.181209 -0.307574
C  -2.644304 1.327823 -0.763197
C  -1.883817 -1.010058 -1.261854
C  -0.284566 0.573615 -0.203155
C  -2.621737 2.529733 0.171933
C  0.51969 0.270255 0.892473
C  0.337522 1.219042 -1.27189
C  -3.584098 3.621531 -0.268749
C  1.867893 0.59986 0.939491
C  1.678064 1.558602 -1.260751
C  0.097369 -2.536817 -1.086196
C  2.434665 1.244514 -0.143592
C  -0.693533 -3.834949 0.323978
H  -2.097144 -0.143177 0.671449
H  -2.385766 1.644343 -1.778928
H  -3.66628 0.94124 -0.824684
H  -1.522985 -0.755581 -2.259102
H  -2.931849 -1.292887 -1.355134
H  -2.874186 2.203446 1.185415
H  -1.610062 2.94066 0.227951
H  -0.241833 1.468222 -2.152401
H  -4.613865 3.259866 -0.2973
H  -3.337559 3.989861 -1.266665
H  -3.555298 4.474687 0.410446
H  2.462003 0.350728 1.807634
H  2.120965 2.059586 -2.110335
H  0.716812 -2.017433 -1.801043
H  -0.789987 -4.6537 1.020124
elementType: Cl N C H
totalener: -1589.16742374 hartree
nucrepener: 1578.00982880 hartree
electener: -3167.17725253 hartree
oneelecener: -5312.92620134 hartree
twoeener: 2145.74894881 hartree
cpcmener: -0.02204426 hartree
kineticenergy: 1584.89153835 hartree
xcener: -108.644565882501 hartree
chargesum: 0.0000000
charge: -0.082816 -0.086815 0.121999 -0.346761 -0.402976 0.130236 -0.192934 -0.113655 -0.087773 -0.065284 0.058946 -0.168001 -0.284286 -0.125687 -0.164205 0.047618 0.099518 0.056666 0.073188 0.076925 0.087580 0.128177 0.119257 0.063804 0.065385 0.141412 0.080288 0.080381 0.092351 0.122600 0.145763 0.170203 0.158894
qa: -0.0828 -0.0868 0.1220 -0.3468 -0.4030 0.1302 -0.1929 -0.1137 -0.0878 -0.0653 0.0589 -0.1680 -0.2843 -0.1257 -0.1642 0.0476 0.0995 0.0567 0.0732 0.0769 0.0876 0.1282 0.1193 0.0638 0.0654 0.1414 0.0803 0.0804 0.0924 0.1226 0.1458 0.1702 0.1589
va: 1.2405 1.2166 3.3497 2.8743 3.0212 3.6959 3.9319 3.8964 3.4809 3.8423 3.8969 3.9341 3.9531 4.0683 4.0518 4.0709 3.8585 4.0553 1.0524 1.0068 1.0108 0.9961 1.0162 1.0087 1.0085 1.0051 1.0008 0.9998 1.0033 1.0213 1.0041 0.9946 0.9961
dispcorr: -0.017942366 hartree
energy: -1589.185366102662
dipole: -28.37860 27.28693 -1.09167 12.06095 -10.40793 1.65303 -11.00932 9.51683 -1.49249
magnitude: 2.48027 au
magnitude: 6.30435 debye
