program: Orca
programVersion: 4.2.1
elementType: Cl Cl N N N C C C C C C C C C C C C C H H H H H H H H H H H H H H H
charge: 0
multiplicity: 1
keywords: wb97x-d3
keywords: def2-TZVPP
keywords: def2/J RIJCOSX GRIDX6 NOFINALGRIDX
keywords: grid4 nofinalgrid
keywords: scfconv7
keywords: smallprint printgap noloewdin
keywords: NOSOSCF
formula: C13H15Cl2N3
InChI: InChI=1/C13H15Cl2N3/c1-2-3-10(7-18-9-16-8-17-18)12-5-4-11(14)6-13(12)15/h4-6,8-10H,2-3,7H2,1H3
33 atoms
Cl 0.341229 0.76164 2.94305
Cl 4.475692 0.967996 -0.436675
N  -1.427988 -1.872179 -0.243147
N  -0.21415 -2.425094 -0.245834
N  -1.386436 -3.114628 -2.023108
C  -1.481621 0.521863 0.463877
C  -2.323488 1.097799 -0.678261
C  -1.827443 -0.941811 0.78749
C  0.005546 0.66571 0.243903
C  -3.795986 1.272348 -0.322626
C  0.908016 0.760802 1.302098
C  0.55247 0.660822 -1.036674
C  -4.597555 1.863724 -1.472141
C  2.277591 0.856753 1.111588
C  1.914812 0.750452 -1.265284
C  -2.115783 -2.291418 -1.309128
C  2.769253 0.849213 -0.181633
C  -0.232964 -3.160157 -1.327719
H  -1.748342 1.080245 1.365944
H  -1.914929 2.075831 -0.94828
H  -2.239841 0.483034 -1.580091
H  -2.899626 -1.051347 0.944969
H  -1.341719 -1.255172 1.709582
H  -4.242975 0.316102 -0.036634
H  -3.880162 1.920211 0.554957
H  -0.099419 0.582244 -1.896168
H  -4.202754 2.834967 -1.776855
H  -5.6426 2.007115 -1.194078
H  -4.578841 1.211721 -2.347876
H  2.945293 0.93607 1.958174
H  2.298386 0.740811 -2.276133
H  -3.130931 -1.988137 -1.51493
H  0.614836 -3.758046 -1.624624
elementType: Cl N C H
totalener: -1589.16480188 hartree
nucrepener: 1560.70294691 hartree
electener: -3149.86774879 hartree
oneelecener: -5278.35226767 hartree
twoeener: 2128.48451888 hartree
cpcmener: -0.02065367 hartree
kineticenergy: 1584.88358771 hartree
xcener: -108.644097384292 hartree
chargesum: -0.0000000
charge: -0.089647 -0.089942 0.118506 -0.340693 -0.410562 0.192876 -0.236006 -0.168211 0.028836 -0.077274 -0.020607 -0.179169 -0.289671 -0.140140 -0.178147 0.054176 0.103378 0.064384 0.074914 0.106561 0.071712 0.144486 0.130214 0.058987 0.069161 0.142488 0.082230 0.093429 0.081014 0.122124 0.144036 0.175667 0.160891
qa: -0.0896 -0.0899 0.1185 -0.3407 -0.4106 0.1929 -0.2360 -0.1682 0.0288 -0.0773 -0.0206 -0.1792 -0.2897 -0.1401 -0.1781 0.0542 0.1034 0.0644 0.0749 0.1066 0.0717 0.1445 0.1302 0.0590 0.0692 0.1425 0.0822 0.0934 0.0810 0.1221 0.1440 0.1757 0.1609
va: 1.2396 1.2135 3.3409 2.8700 3.0380 3.6435 3.9494 3.8944 3.4840 3.8564 4.0073 3.9144 3.9553 4.0845 4.0770 4.0581 3.8584 4.0352 1.0314 1.0106 1.0039 0.9931 1.0235 1.0124 1.0061 1.0011 1.0009 1.0039 1.0001 1.0214 1.0055 0.9922 0.9956
dispcorr: -0.017483721 hartree
energy: -1589.182285601455
dipole: -34.79113 33.04400 -1.74713 3.45047 -2.38309 1.06737 -11.53195 11.76410 0.23215
magnitude: 2.06050 au
magnitude: 5.23737 debye
