program: Orca
programVersion: 4.2.1
elementType: Cl Cl N N N C C C C C C C C C C C C C H H H H H H H H H H H H H H H
charge: 0
multiplicity: 1
keywords: wb97x-d3
keywords: def2-TZVPP
keywords: def2/J RIJCOSX GRIDX6 NOFINALGRIDX
keywords: grid4 nofinalgrid
keywords: scfconv7
keywords: smallprint printgap noloewdin
keywords: NOSOSCF
formula: C13H15Cl2N3
InChI: InChI=1/C13H15Cl2N3/c1-2-3-10(7-18-9-16-8-17-18)12-5-4-11(14)6-13(12)15/h4-6,8-10H,2-3,7H2,1H3
33 atoms
Cl 0.865943 0.21793 2.666117
Cl 3.87254 3.486909 -0.297283
N  -1.548926 -2.604501 -1.005999
N  -1.347409 -3.557082 -0.094776
N  -3.311873 -3.869956 -1.127664
C  -0.512265 -0.653651 0.065837
C  -1.854221 0.008561 0.42132
C  -0.598334 -1.535331 -1.183035
C  0.597885 0.363354 -0.037082
C  -2.408213 0.984161 -0.609457
C  1.268625 0.826493 1.096275
C  0.989212 0.91823 -1.253542
C  -3.727871 1.594798 -0.15781
C  2.271553 1.78041 1.029263
C  1.987476 1.872553 -1.353722
C  -2.728322 -2.802825 -1.610391
C  2.625702 2.299469 -0.203282
C  -2.427512 -4.293593 -0.202672
H  -0.266255 -1.33276 0.885857
H  -2.590375 -0.777496 0.614525
H  -1.731572 0.530103 1.373763
H  0.377551 -1.969885 -1.404555
H  -0.916484 -0.978254 -2.064428
H  -1.684825 1.781847 -0.795774
H  -2.563867 0.483413 -1.570452
H  0.501729 0.605093 -2.167038
H  -4.485373 0.826617 0.004102
H  -4.118153 2.292953 -0.898058
H  -3.608652 2.140868 0.778851
H  2.769667 2.110765 1.929511
H  2.26284 2.278331 -2.316782
H  -3.110812 -2.15685 -2.385964
H  -2.579397 -5.1716 0.405036
totalener: -1589.14190458 hartree
nucrepener: 1524.00257710 hartree
electener: -3113.14448167 hartree
oneelecener: -5204.47832233 hartree
twoeener: 2091.33384066 hartree
kineticenergy: 1584.87855831 hartree
xcener: -108.642767364091 hartree
chargesum: 0.0000000
charge: -0.066629 -0.067890 0.114056 -0.310307 -0.329503 0.175214 -0.190241 -0.213793 0.016912 -0.095766 -0.039360 -0.179992 -0.264878 -0.131552 -0.137441 0.042227 0.086011 0.064304 0.105094 0.095937 0.090684 0.140304 0.098083 0.071501 0.050495 0.120481 0.081589 0.087249 0.080440 0.115277 0.123685 0.134501 0.133306
qa: -0.0666 -0.0679 0.1141 -0.3103 -0.3295 0.1752 -0.1902 -0.2138 0.0169 -0.0958 -0.0394 -0.1800 -0.2649 -0.1316 -0.1374 0.0422 0.0860 0.0643 0.1051 0.0959 0.0907 0.1403 0.0981 0.0715 0.0505 0.1205 0.0816 0.0872 0.0804 0.1153 0.1237 0.1345 0.1333
va: 1.2611 1.2366 3.3064 2.8620 3.0647 3.5433 3.8959 3.9861 3.5201 3.8405 4.0579 3.9276 3.9675 4.0676 4.0874 4.0734 3.9390 4.0459 1.0467 1.0084 1.0204 1.0048 0.9881 1.0068 1.0047 1.0077 1.0026 1.0044 1.0031 1.0232 1.0130 1.0031 1.0010
dispcorr: -0.016670452 hartree
energy: -1589.158575027806
dipole: -26.98942 27.10283 0.11341 -4.72162 5.56947 0.84785 -10.21510 9.49778 -0.71732
magnitude: 1.11636 au
magnitude: 2.83757 debye
