program: Orca
programVersion: 4.2.1
elementType: Cl Cl N N N C C C C C C C C C C C C C H H H H H H H H H H H H H H H
charge: 0
multiplicity: 1
keywords: wb97x-d3
keywords: def2-TZVPP
keywords: def2/J RIJCOSX GRIDX6 NOFINALGRIDX
keywords: grid4 nofinalgrid
keywords: scfconv7
keywords: smallprint printgap noloewdin
keywords: NOSOSCF
formula: C13H15Cl2N3
InChI: InChI=1/C13H15Cl2N3/c1-2-3-10(7-18-9-16-8-17-18)12-5-4-11(14)6-13(12)15/h4-6,8-10H,2-3,7H2,1H3
33 atoms
Cl 0.641411 0.323492 2.754968
Cl 4.006401 3.363532 -0.063426
N  -1.479432 -2.625809 -1.010388
N  -2.698207 -2.498663 -1.541831
N  -2.517901 -4.456705 -0.466732
C  -0.542615 -0.610702 0.074642
C  -1.893402 0.107948 0.233316
C  -0.499064 -1.573818 -1.118047
C  0.605619 0.368893 0.034619
C  -2.320618 0.98547 -0.935717
C  1.196438 0.853705 1.202438
C  1.11269 0.866167 -1.164414
C  -3.648366 1.677279 -0.65961
C  2.236718 1.769224 1.185449
C  2.149999 1.781501 -1.214751
C  -1.391043 -3.799254 -0.368677
C  2.709735 2.227629 -0.031029
C  -3.285637 -3.61738 -1.190999
H  -0.412049 -1.230784 0.966289
H  -2.667332 -0.641385 0.41923
H  -1.843375 0.714645 1.141727
H  0.488741 -2.033849 -1.183515
H  -0.687027 -1.075303 -2.067102
H  -1.55627 1.74007 -1.140302
H  -2.420924 0.379856 -1.839783
H  0.685537 0.538321 -2.102498
H  -4.44296 0.94937 -0.490994
H  -3.950438 2.306278 -1.496745
H  -3.588376 2.312616 0.225495
H  2.671044 2.117646 2.111554
H  2.515425 2.14313 -2.165388
H  -0.497404 -4.131231 0.138337
H  -4.302515 -3.838969 -1.474757
totalener: -1589.14156102 hartree
nucrepener: 1522.12899465 hartree
electener: -3111.27055566 hartree
oneelecener: -5200.79848685 hartree
twoeener: 2089.52793118 hartree
kineticenergy: 1584.87670538 hartree
xcener: -108.641788990524 hartree
chargesum: 0.0000000
charge: -0.069659 -0.067269 0.114800 -0.317070 -0.333281 0.123058 -0.164258 -0.195399 0.053733 -0.086071 -0.044994 -0.203331 -0.274114 -0.127097 -0.131550 0.039280 0.082133 0.065221 0.080747 0.089434 0.087960 0.134179 0.117253 0.066273 0.068455 0.126940 0.084428 0.085792 0.075842 0.115214 0.124465 0.144994 0.133890
qa: -0.0697 -0.0673 0.1148 -0.3171 -0.3333 0.1231 -0.1643 -0.1954 0.0537 -0.0861 -0.0450 -0.2033 -0.2741 -0.1271 -0.1315 0.0393 0.0821 0.0652 0.0807 0.0894 0.0880 0.1342 0.1173 0.0663 0.0685 0.1269 0.0844 0.0858 0.0758 0.1152 0.1245 0.1450 0.1339
va: 1.2584 1.2372 3.3179 2.8445 3.0649 3.6878 3.8973 3.9286 3.4795 3.8242 4.0525 3.9455 3.9716 4.0629 4.0786 4.0739 3.9400 4.0421 1.0362 1.0166 1.0180 1.0028 1.0033 1.0057 1.0174 1.0080 1.0024 1.0048 1.0021 1.0226 1.0126 0.9998 1.0002
dispcorr: -0.016588302 hartree
energy: -1589.158149318224
dipole: -25.36531 25.96052 0.59521 -5.13644 5.60511 0.46868 -11.89859 11.55696 -0.34163
magnitude: 0.83105 au
magnitude: 2.11237 debye
