program: Orca
programVersion: 4.2.1
elementType: Cl Cl N N N C C C C C C C C C C C C C H H H H H H H H H H H H H H H
charge: 0
multiplicity: 1
keywords: wb97x-d3
keywords: def2-TZVPP
keywords: def2/J RIJCOSX GRIDX6 NOFINALGRIDX
keywords: grid4 nofinalgrid
keywords: scfconv7
keywords: smallprint printgap noloewdin
keywords: NOSOSCF
formula: C13H15Cl2N3
InChI: InChI=1/C13H15Cl2N3/c1-2-3-10(7-18-9-16-8-17-18)12-5-4-11(14)6-13(12)15/h4-6,8-10H,2-3,7H2,1H3
33 atoms
Cl 0.61379 0.156013 2.508289
Cl 3.920195 3.296134 -0.269579
N  -1.32276 -2.832208 -0.712468
N  -1.883894 -3.236406 0.427892
N  -2.836258 -4.269691 -1.319057
C  -0.799304 -0.468628 -0.197982
C  -1.994241 0.050584 -1.002175
C  -0.294122 -1.82243 -0.713867
C  0.368619 0.487424 -0.182188
C  -2.50378 1.417919 -0.554033
C  1.06951 0.818938 0.975355
C  0.825953 1.056054 -1.369999
C  -2.936266 1.463126 0.905542
C  2.157113 1.681194 0.960535
C  1.908529 1.914509 -1.419034
C  -1.906275 -3.453938 -1.746326
C  2.569372 2.224708 -0.241715
C  -2.783706 -4.098434 0.017416
H  -1.133654 -0.636518 0.826448
H  -1.750588 0.084903 -2.069785
H  -2.808119 -0.673779 -0.907998
H  0.536588 -2.168352 -0.096907
H  0.073425 -1.733035 -1.738307
H  -1.741035 2.180469 -0.733418
H  -3.351141 1.687127 -1.18964
H  0.311402 0.826337 -2.294983
H  -3.389926 2.424124 1.147333
H  -2.097754 1.324702 1.588968
H  -3.671368 0.686744 1.12606
H  2.673843 1.921282 1.878704
H  2.232873 2.338944 -2.358595
H  -1.619947 -3.287038 -2.773821
H  -3.422825 -4.625185 0.708746
totalener: -1589.14284697 hartree
nucrepener: 1535.58668005 hartree
electener: -3124.72952702 hartree
oneelecener: -5227.76521583 hartree
twoeener: 2103.03568881 hartree
kineticenergy: 1584.87595431 hartree
xcener: -108.641319541362 hartree
chargesum: -0.0000000
charge: -0.062329 -0.067244 0.096643 -0.308558 -0.331209 0.111103 -0.210593 -0.127890 0.019156 -0.099080 -0.007491 -0.199713 -0.257426 -0.129697 -0.148599 0.047097 0.088813 0.063842 0.099392 0.073353 0.100764 0.122435 0.104472 0.067162 0.073294 0.123627 0.089083 0.076177 0.084551 0.115791 0.124962 0.134950 0.133162
qa: -0.0623 -0.0672 0.0966 -0.3086 -0.3312 0.1111 -0.2106 -0.1279 0.0192 -0.0991 -0.0075 -0.1997 -0.2574 -0.1297 -0.1486 0.0471 0.0888 0.0638 0.0994 0.0734 0.1008 0.1224 0.1045 0.0672 0.0733 0.1236 0.0891 0.0762 0.0846 0.1158 0.1250 0.1349 0.1332
va: 1.2618 1.2374 3.3241 2.8539 3.0598 3.5835 3.9126 3.9334 3.4395 3.9048 4.0377 3.9772 3.9349 4.0487 4.0893 4.0692 3.9324 4.0458 1.0436 1.0124 1.0064 1.0102 1.0017 1.0082 1.0064 1.0086 1.0074 1.0107 1.0046 1.0229 1.0121 1.0037 1.0010
dispcorr: -0.017225104 hartree
energy: -1589.160072069284
dipole: -24.28999 24.65967 0.36968 -4.08850 4.81510 0.72660 -9.27812 8.50656 -0.77156
magnitude: 1.12246 au
magnitude: 2.85306 debye
