program: Orca
programVersion: 4.2.1
elementType: Cl Cl N N N C C C C C C C C C C C C C H H H H H H H H H H H H H H H
charge: 0
multiplicity: 1
keywords: wb97x-d3
keywords: def2-TZVPP
keywords: def2/J RIJCOSX GRIDX6 NOFINALGRIDX
keywords: grid4 nofinalgrid
keywords: scfconv7
keywords: smallprint printgap noloewdin
keywords: NOSOSCF
formula: C13H15Cl2N3
InChI: InChI=1/C13H15Cl2N3/c1-2-3-10(7-18-9-16-8-17-18)12-5-4-11(14)6-13(12)15/h4-6,8-10H,2-3,7H2,1H3
33 atoms
Cl -0.40487 -0.053624 2.327208
Cl 4.071796 1.479359 -0.139705
N  -1.186369 -2.140384 -0.737851
N  -0.033012 -2.452527 -1.335493
N  -0.320179 -3.698425 0.505892
C  -1.824432 0.238972 -0.445406
C  -2.650735 1.353011 -1.096911
C  -2.011517 -1.066199 -1.230707
C  -0.359104 0.575188 -0.326831
C  -2.552658 2.70784 -0.403175
C  0.361709 0.456931 0.857263
C  0.353798 0.982197 -1.452289
C  -3.037738 2.701358 1.039813
C  1.720224 0.732482 0.92765
C  1.704834 1.266024 -1.416344
C  -1.336941 -2.887979 0.364571
C  2.382903 1.136706 -0.215136
C  0.450021 -3.390749 -0.558392
H  -2.225425 0.070153 0.555439
H  -2.36008 1.464788 -2.146357
H  -3.698702 1.034251 -1.113727
H  -1.753858 -0.932774 -2.281076
H  -3.058776 -1.37325 -1.188719
H  -1.52104 3.066799 -0.441569
H  -3.141901 3.425967 -0.978705
H  -0.164531 1.074595 -2.39852
H  -2.401672 2.095946 1.68603
H  -4.054919 2.311763 1.115666
H  -3.04362 3.709985 1.452463
H  2.249863 0.62705 1.863467
H  2.226177 1.576457 -2.310469
H  -2.191052 -2.811296 1.019987
H  1.391184 -3.873498 -0.769082
totalener: -1589.14049789 hartree
nucrepener: 1598.31975428 hartree
electener: -3187.46025217 hartree
oneelecener: -5353.66983400 hartree
twoeener: 2166.20958183 hartree
kineticenergy: 1584.89164340 hartree
xcener: -108.644559606210 hartree
chargesum: 0.0000000
charge: -0.079270 -0.070663 0.123526 -0.299446 -0.323927 0.049263 -0.188728 -0.138526 0.031805 -0.095709 0.010503 -0.144903 -0.262888 -0.115952 -0.134866 0.018420 0.088035 0.057817 0.073714 0.076087 0.083580 0.114875 0.117248 0.071268 0.073706 0.106027 0.079617 0.076393 0.091311 0.115587 0.122361 0.142499 0.131238
qa: -0.0793 -0.0707 0.1235 -0.2994 -0.3239 0.0493 -0.1887 -0.1385 0.0318 -0.0957 0.0105 -0.1449 -0.2629 -0.1160 -0.1349 0.0184 0.0880 0.0578 0.0737 0.0761 0.0836 0.1149 0.1172 0.0713 0.0737 0.1060 0.0796 0.0764 0.0913 0.1156 0.1224 0.1425 0.1312
va: 1.2408 1.2342 3.3213 2.8600 3.0591 3.7263 3.9377 3.9066 3.4438 3.8847 3.9539 3.9785 3.9258 4.0719 4.0899 4.0841 3.9378 4.0522 1.0350 1.0128 1.0082 1.0119 1.0026 1.0096 1.0069 1.0142 1.0158 1.0041 1.0081 1.0200 1.0113 1.0031 1.0022
dispcorr: -0.018832051 hartree
energy: -1589.159329939633
dipole: -27.32397 26.02416 -1.29981 8.65061 -7.66330 0.98731 -8.59728 7.97071 -0.62657
magnitude: 1.74840 au
magnitude: 4.44407 debye
