program: Orca
programVersion: 4.2.1
elementType: Cl Cl N N N C C C C C C C C C C C C C H H H H H H H H H H H H H H H
charge: 0
multiplicity: 1
keywords: wb97x-d3
keywords: def2-TZVPP
keywords: def2/J RIJCOSX GRIDX6 NOFINALGRIDX
keywords: grid4 nofinalgrid
keywords: scfconv7
keywords: smallprint printgap noloewdin
keywords: NOSOSCF
formula: C13H15Cl2N3
InChI: InChI=1/C13H15Cl2N3/c1-2-3-10(7-18-9-16-8-17-18)12-5-4-11(14)6-13(12)15/h4-6,8-10H,2-3,7H2,1H3
33 atoms
Cl 0.340096 0.861509 2.947791
Cl 4.490408 1.003357 -0.4136
N  -1.461889 -1.870706 -0.230085
N  -0.251263 -2.429145 -0.299565
N  -1.507189 -3.077449 -2.039836
C  -1.462083 0.52125 0.473918
C  -2.305113 1.077076 -0.67666
C  -1.797466 -0.940383 0.81889
C  0.023939 0.67272 0.253061
C  -3.791873 1.194295 -0.357344
C  0.917419 0.815672 1.312562
C  0.577795 0.627744 -1.022727
C  -4.570195 1.855916 -1.485397
C  2.285739 0.921371 1.123898
C  1.939299 0.726001 -1.246118
C  -2.198457 -2.268356 -1.278995
C  2.788246 0.875096 -0.163886
C  -0.322408 -3.142821 -1.396508
H  -1.730041 1.093949 1.367089
H  -1.922808 2.070881 -0.927896
H  -2.181869 0.474882 -1.582217
H  -2.861595 -1.041504 1.034633
H  -1.257454 -1.250109 1.711829
H  -4.223884 0.208706 -0.160289
H  -3.922651 1.768341 0.564667
H  -0.070546 0.50332 -1.879238
H  -4.20134 2.863154 -1.682264
H  -5.63021 1.934477 -1.245794
H  -4.483876 1.288811 -2.413239
H  2.947194 1.035242 1.970619
H  2.333943 0.681532 -2.251135
H  -3.220894 -1.958626 -1.435748
H  0.508617 -3.7368 -1.742908
totalener: -1589.14106308 hartree
nucrepener: 1559.67089940 hartree
electener: -3148.81196249 hartree
oneelecener: -5276.17135834 hartree
twoeener: 2127.35939586 hartree
kineticenergy: 1584.88365465 hartree
xcener: -108.643023351829 hartree
chargesum: -0.0000000
charge: -0.081928 -0.072557 0.121863 -0.303926 -0.328589 0.177572 -0.245086 -0.185569 0.029602 -0.091602 -0.004200 -0.166661 -0.263084 -0.139605 -0.147789 0.017697 0.099224 0.064248 0.074863 0.106121 0.070337 0.129021 0.134785 0.048942 0.070725 0.123265 0.079677 0.090309 0.078223 0.112436 0.121800 0.146249 0.133638
qa: -0.0819 -0.0726 0.1219 -0.3039 -0.3286 0.1776 -0.2451 -0.1856 0.0296 -0.0916 -0.0042 -0.1667 -0.2631 -0.1396 -0.1478 0.0177 0.0992 0.0642 0.0749 0.1061 0.0703 0.1290 0.1348 0.0489 0.0707 0.1233 0.0797 0.0903 0.0782 0.1124 0.1218 0.1462 0.1336
va: 1.2505 1.2321 3.2934 2.8459 3.0692 3.6421 3.9306 3.9156 3.5388 3.8736 4.0309 3.9487 3.9605 4.0996 4.0963 4.0786 3.9314 4.0320 1.0351 1.0129 1.0041 0.9917 1.0247 1.0099 1.0078 1.0052 1.0040 1.0059 1.0022 1.0231 1.0126 0.9992 1.0012
dispcorr: -0.017520711 hartree
energy: -1589.158583792910
dipole: -34.60612 33.43772 -1.16839 2.86410 -2.04976 0.81434 -11.60465 11.82146 0.21681
magnitude: 1.44059 au
magnitude: 3.66169 debye
