program: Orca
programVersion: 4.2.1
elementType: Cl Cl N N N C C C C C C C C C C C C C H H H H H H H H H H H H H H H
charge: 0
multiplicity: 1
keywords: wb97x-d3
keywords: def2-TZVPP
keywords: def2/J RIJCOSX GRIDX6 NOFINALGRIDX
keywords: grid4 nofinalgrid
keywords: scfconv7
keywords: smallprint printgap noloewdin
keywords: NOSOSCF
formula: C13H15Cl2N3
InChI: InChI=1/C13H15Cl2N3/c1-2-3-10(7-18-9-16-8-17-18)12-5-4-11(14)6-13(12)15/h4-6,8-10H,2-3,7H2,1H3
33 atoms
Cl 0.02397 -0.369536 2.125792
Cl 4.49999 1.324014 -0.237246
N  -1.326686 -1.837957 -0.650165
N  -2.035458 -2.471401 0.287127
N  -0.063515 -3.491543 -0.024138
C  -1.494868 0.623113 -0.405296
C  -2.214567 1.853343 -0.973474
C  -1.815033 -0.621555 -1.24472
C  0.000944 0.811887 -0.324942
C  -3.72539 1.875264 -0.742272
C  0.765349 0.387684 0.761259
C  0.695208 1.388666 -1.387329
C  -4.130051 1.945931 0.723863
C  2.144392 0.541956 0.798032
C  2.06836 1.553005 -1.381111
C  -0.147592 -2.454536 -0.816868
C  2.787389 1.127055 -0.276617
C  -1.241989 -3.456206 0.631226
H  -1.875083 0.439691 0.600755
H  -1.779098 2.749092 -0.522353
H  -2.024131 1.934938 -2.048643
H  -1.375528 -0.52585 -2.239995
H  -2.891036 -0.734971 -1.370242
H  -4.127637 2.746629 -1.264628
H  -4.201313 1.010587 -1.212763
H  0.144949 1.728557 -2.255528
H  -3.856829 1.046325 1.275636
H  -5.208651 2.065007 0.824071
H  -3.658027 2.794392 1.221941
H  2.705717 0.20304 1.656862
H  2.571987 2.008636 -2.221838
H  0.599642 -2.119713 -1.520496
H  -1.524657 -4.180069 1.379276
totalener: -1589.14066991 hartree
nucrepener: 1581.49239318 hartree
electener: -3170.63306309 hartree
oneelecener: -5319.84492642 hartree
twoeener: 2149.21186332 hartree
kineticenergy: 1584.88792792 hartree
xcener: -108.644384940221 hartree
chargesum: -0.0000000
charge: -0.060400 -0.066978 0.112815 -0.307924 -0.319795 0.084355 -0.173697 -0.125629 -0.015314 -0.115525 0.015818 -0.186898 -0.255384 -0.111116 -0.164561 0.020892 0.090976 0.058333 0.094393 0.100870 0.070579 0.114388 0.118769 0.073992 0.055679 0.124621 0.084033 0.090065 0.079821 0.117100 0.123895 0.143300 0.128529
qa: -0.0604 -0.0670 0.1128 -0.3079 -0.3198 0.0844 -0.1737 -0.1256 -0.0153 -0.1155 0.0158 -0.1869 -0.2554 -0.1111 -0.1646 0.0209 0.0910 0.0583 0.0944 0.1009 0.0706 0.1144 0.1188 0.0740 0.0557 0.1246 0.0840 0.0901 0.0798 0.1171 0.1239 0.1433 0.1285
va: 1.2677 1.2376 3.3270 2.8494 3.0541 3.7007 3.9213 3.9037 3.4091 3.9168 3.9943 3.9881 3.9271 4.0462 4.0987 4.0958 3.9335 4.0573 1.0343 1.0044 1.0122 0.9972 1.0208 1.0069 1.0103 1.0070 1.0066 1.0064 1.0025 1.0226 1.0139 1.0001 1.0026
dispcorr: -0.018008223 hartree
energy: -1589.158678136678
dipole: -31.35083 30.71080 -0.64003 9.03968 -7.73058 1.30910 -9.68121 8.66020 -1.02101
magnitude: 1.77927 au
magnitude: 4.52256 debye
