program: Orca
programVersion: 4.2.1
elementType: Cl Cl N N N C C C C C C C C C C C C C H H H H H H H H H H H H H H H
charge: 0
multiplicity: 1
keywords: wb97x-d3
keywords: def2-TZVPP
keywords: def2/J RIJCOSX GRIDX6 NOFINALGRIDX
keywords: grid4 nofinalgrid
keywords: scfconv7
keywords: smallprint printgap noloewdin
keywords: NOSOSCF
formula: C13H15Cl2N3
InChI: InChI=1/C13H15Cl2N3/c1-2-3-10(7-18-9-16-8-17-18)12-5-4-11(14)6-13(12)15/h4-6,8-10H,2-3,7H2,1H3
33 atoms
Cl -0.267985 -0.143665 2.474671
Cl 4.064104 1.489453 -0.180144
N  -1.179703 -2.164175 -0.758085
N  -0.131009 -2.470071 -1.526924
N  -0.152099 -3.753489 0.31063
C  -1.821406 0.164364 -0.21989
C  -2.690896 1.329258 -0.698084
C  -2.056075 -1.071762 -1.097295
C  -0.35325 0.507978 -0.171347
C  -2.595603 2.55969 0.194897
C  0.42349 0.389139 0.977048
C  0.298379 0.93707 -1.325231
C  -3.508326 3.685789 -0.267309
C  1.778949 0.687322 0.986539
C  1.644815 1.244438 -1.34849
C  -1.171394 -2.934375 0.339507
C  2.380118 1.115853 -0.181343
C  0.4537 -3.427997 -0.850027
H  -2.152948 -0.085747 0.790108
H  -2.429276 1.600846 -1.726395
H  -3.732426 0.991818 -0.73652
H  -1.879555 -0.848718 -2.148729
H  -3.094347 -1.397363 -1.003991
H  -2.843979 2.279807 1.222712
H  -1.562414 2.914128 0.221086
H  -0.264775 1.029761 -2.245713
H  -4.554878 3.377214 -0.269486
H  -3.258948 4.007773 -1.279623
H  -3.424189 4.556221 0.382602
H  2.35365 0.582045 1.895411
H  2.119563 1.571888 -2.262373
H  -1.915404 -2.866649 1.118607
H  1.349402 -3.911459 -1.206496
totalener: -1589.14143945 hartree
nucrepener: 1579.59637187 hartree
electener: -3168.73781132 hartree
oneelecener: -5316.17044007 hartree
twoeener: 2147.43262875 hartree
kineticenergy: 1584.89496419 hartree
xcener: -108.643291209461 hartree
chargesum: 0.0000000
charge: -0.077734 -0.070321 0.125283 -0.300001 -0.324877 0.090009 -0.189868 -0.139835 -0.039210 -0.071677 0.044181 -0.125506 -0.260737 -0.119554 -0.139250 0.020723 0.090162 0.059333 0.067392 0.068135 0.077389 0.114964 0.118313 0.062793 0.070854 0.101830 0.073656 0.075555 0.090123 0.113506 0.122210 0.140515 0.131645
qa: -0.0777 -0.0703 0.1253 -0.3000 -0.3249 0.0900 -0.1899 -0.1398 -0.0392 -0.0717 0.0442 -0.1255 -0.2607 -0.1196 -0.1393 0.0207 0.0902 0.0593 0.0674 0.0681 0.0774 0.1150 0.1183 0.0628 0.0709 0.1018 0.0737 0.0756 0.0901 0.1135 0.1222 0.1405 0.1316
va: 1.2439 1.2345 3.3263 2.8638 3.0611 3.7258 3.9372 3.9097 3.5215 3.8523 3.9248 3.9759 3.9566 4.0667 4.0875 4.0846 3.9243 4.0522 1.0446 1.0099 1.0130 1.0106 1.0014 1.0102 1.0109 1.0167 1.0025 1.0017 1.0057 1.0213 1.0114 1.0051 1.0018
dispcorr: -0.017956011 hartree
energy: -1589.159395459182
dipole: -28.90694 27.57374 -1.33320 10.83753 -9.83283 1.00470 -9.98811 9.56421 -0.42390
magnitude: 1.72236 au
magnitude: 4.37789 debye
