program: Orca
programVersion: 4.2.1
elementType: O O O O N N N C C C C C C C C C C C C C C C C C C H H H H H H H H H H H H H H H H H H H H H H H
charge: 0
multiplicity: 1
keywords: wb97x-d3
keywords: def2-TZVPP
keywords: def2/J RIJCOSX GRIDX6 NOFINALGRIDX
keywords: grid4 nofinalgrid
keywords: scfconv7
keywords: smallprint printgap noloewdin
keywords: NOSOSCF
formula: C18H23N3O4
InChI: InChI=1/C18H23N3O4/c1-3-5-6-11-25-17(22)16(4-2)21(13-15-8-7-12-24-15)18(23)20-10-9-19-14-20/h3,7-10,12,14,16H,1,4-6,11,13H2,2H3
48 atoms
O  0.085127 -1.014475 0.171932
O  -3.686575 0.448638 0.04904
O  -1.49961 -0.926534 1.743794
O  0.163464 1.273381 -2.425613
N  -0.508779 1.665021 -0.283281
N  1.764954 1.498942 -0.845379
N  3.912719 1.008276 -0.883885
C  -0.346831 1.10691 1.06472
C  -1.120343 1.878946 2.125714
C  -1.884283 1.872026 -0.738898
C  -0.680541 -0.387403 1.043926
C  0.414271 1.447033 -1.253024
C  -0.599675 1.60462 3.529161
C  -2.687719 0.623636 -0.852528
C  -0.120216 -2.420838 -0.039531
C  0.939368 -2.90758 -0.997767
C  -2.630651 -0.449331 -1.68055
C  2.367782 -2.804923 -0.458644
C  2.364645 2.302139 0.102857
C  2.753979 0.748869 -1.408379
C  -3.656687 -1.343938 -1.254513
C  -4.260353 -0.746034 -0.201959
C  3.681368 1.982688 0.056933
C  2.570491 -3.600599 0.789854
C  2.899771 -3.087589 1.969224
H  0.709394 1.164392 1.333484
H  -1.008517 2.944415 1.914134
H  -2.187082 1.659627 2.077255
H  -1.846499 2.390713 -1.694262
H  -2.368803 2.558859 -0.045376
H  0.45433 1.87246 3.619395
H  -1.151304 2.199123 4.256889
H  -0.704437 0.559101 3.815637
H  -1.119182 -2.576617 -0.452768
H  -0.061655 -2.948195 0.915107
H  0.862292 -2.364739 -1.943333
H  0.706968 -3.951305 -1.225091
H  -1.938445 -0.589734 -2.494179
H  2.63349 -1.761241 -0.277744
H  3.047578 -3.167965 -1.234927
H  1.829873 3.042404 0.672735
H  2.558318 0.031069 -2.188575
H  -3.90785 -2.302909 -1.677195
H  -5.081588 -1.031122 0.435328
H  4.478703 2.408447 0.64373
H  2.419297 -4.673927 0.705537
H  3.033317 -3.711545 2.843606
H  3.056473 -2.023259 2.103844
elementType: O N C H
totalener: -1165.01524905 hartree
nucrepener: 2414.23055638 hartree
electener: -3579.24580543 hartree
oneelecener: -6385.29811103 hartree
twoeener: 2806.05230560 hartree
cpcmener: -0.03902951 hartree
kineticenergy: 1160.04706164 hartree
xcener: -111.464689117517 hartree
chargesum: 0.0000000
charge: -0.255294 -0.275336 -0.433705 -0.466859 -0.141116 0.001390 -0.386831 0.105464 -0.090974 -0.064775 0.297783 0.390769 -0.285343 0.210910 -0.063289 -0.138172 -0.290023 -0.033169 -0.164836 0.044644 -0.177215 -0.039557 -0.110328 -0.216932 -0.271822 0.118730 0.091021 0.078093 0.131465 0.134308 0.084322 0.101033 0.087891 0.134651 0.118982 0.083269 0.094435 0.162379 0.051611 0.098499 0.200283 0.176190 0.180477 0.178634 0.171726 0.136238 0.134001 0.106375
qa: -0.2553 -0.2753 -0.4337 -0.4669 -0.1411 0.0014 -0.3868 0.1055 -0.0910 -0.0648 0.2978 0.3908 -0.2853 0.2109 -0.0633 -0.1382 -0.2900 -0.0332 -0.1648 0.0446 -0.1772 -0.0396 -0.1103 -0.2169 -0.2718 0.1187 0.0910 0.0781 0.1315 0.1343 0.0843 0.1010 0.0879 0.1347 0.1190 0.0833 0.0944 0.1624 0.0516 0.0985 0.2003 0.1762 0.1805 0.1786 0.1717 0.1362 0.1340 0.1064
va: 2.1478 2.2731 2.0535 2.0267 3.0772 3.2605 3.0802 3.9080 3.8606 3.8848 4.1979 4.2424 3.9489 3.3738 3.8562 3.9245 3.9074 3.8456 3.9105 4.0124 3.8815 3.8832 4.0356 3.8239 3.9206 0.9997 1.0114 1.0206 1.0130 1.0022 1.0014 1.0012 1.0124 0.9971 1.0077 1.0178 1.0143 1.0153 1.0303 1.0065 0.9830 0.9947 0.9881 0.9879 0.9992 1.0010 1.0019 1.0116
dispcorr: -0.030421321 hartree
energy: -1165.045670370757
dipole: 4.22842 -5.34272 -1.11430 -9.26361 9.49199 0.22838 11.44890 -10.68864 0.76026
magnitude: 1.36815 au
magnitude: 3.47756 debye
