program: Orca
programVersion: 4.2.1
elementType: O O O O N N N C C C C C C C C C C C C C C C C C C H H H H H H H H H H H H H H H H H H H H H H H
charge: 0
multiplicity: 1
keywords: wb97x-d3
keywords: def2-TZVPP
keywords: def2/J RIJCOSX GRIDX6 NOFINALGRIDX
keywords: grid4 nofinalgrid
keywords: scfconv7
keywords: smallprint printgap noloewdin
keywords: NOSOSCF
formula: C18H23N3O4
InChI: InChI=1/C18H23N3O4/c1-3-5-6-11-25-17(22)16(4-2)21(13-15-8-7-12-24-15)18(23)20-10-9-19-14-20/h3,7-10,12,14,16H,1,4-6,11,13H2,2H3
48 atoms
O  0.661792 -0.648242 0.650161
O  -3.221489 -0.03954 0.426335
O  -0.771032 -0.601859 2.365342
O  0.416979 1.070074 -2.228833
N  -0.38338 1.721543 -0.194824
N  1.906531 1.828484 -0.70543
N  4.09124 1.611945 -0.527549
C  -0.161835 1.462384 1.232871
C  -1.122431 2.213942 2.142482
C  -1.756228 1.555235 -0.677811
C  -0.156667 -0.045242 1.490823
C  0.595221 1.490021 -1.106548
C  -1.051935 3.720766 1.955295
C  -2.29324 0.171385 -0.541623
C  0.710794 -2.082402 0.628436
C  1.476298 -2.489053 -0.611329
C  -2.033255 -0.997703 -1.179134
C  1.445483 -4.004747 -0.815904
C  2.342899 2.900254 0.044211
C  3.008804 1.093418 -1.023288
C  -2.845898 -1.990185 -0.555947
C  -3.54239 -1.349623 0.410736
C  3.687534 2.747011 0.132993
C  0.075234 -4.504545 -1.148805
C  -0.63243 -5.348396 -0.407429
H  0.842477 1.80005 1.497302
H  -2.14797 1.861967 2.025473
H  -0.840403 1.971139 3.167649
H  -1.788824 1.872847 -1.717068
H  -2.395608 2.25097 -0.135526
H  -0.043864 4.097914 2.135673
H  -1.350994 4.035971 0.955066
H  -1.71523 4.218626 2.661809
H  -0.305784 -2.479937 0.612157
H  1.205718 -2.444827 1.532611
H  2.513322 -2.154737 -0.532017
H  1.04692 -1.994083 -1.487634
H  -1.339713 -1.138833 -1.991858
H  1.828782 -4.513237 0.07288
H  2.12644 -4.248682 -1.63553
H  1.686863 3.67958 0.392608
H  2.95033 0.189059 -1.607357
H  -2.896889 -3.039689 -0.795553
H  -4.277193 -1.676932 1.128292
H  4.389532 3.396641 0.629915
H  -0.359376 -4.117478 -2.067463
H  -1.624288 -5.667257 -0.701409
H  -0.245685 -5.75605 0.519865
elementType: O N C H
totalener: -1165.01515921 hartree
nucrepener: 2408.85993934 hartree
electener: -3573.87509855 hartree
oneelecener: -6374.21634434 hartree
twoeener: 2800.34124579 hartree
cpcmener: -0.04016358 hartree
kineticenergy: 1160.03813951 hartree
xcener: -111.465515042188 hartree
chargesum: -0.0000000
charge: -0.262393 -0.275060 -0.438879 -0.464376 -0.123074 -0.001701 -0.389315 0.041477 -0.085856 -0.064757 0.327069 0.374718 -0.287232 0.195313 -0.022861 -0.135133 -0.266717 -0.063931 -0.175411 0.065447 -0.178046 -0.036181 -0.113383 -0.201687 -0.280128 0.145172 0.079376 0.087604 0.130453 0.134250 0.083790 0.086698 0.107158 0.092437 0.134268 0.093977 0.080232 0.160291 0.075596 0.095179 0.209258 0.168489 0.171852 0.177871 0.172400 0.132923 0.129056 0.113767
qa: -0.2624 -0.2751 -0.4389 -0.4644 -0.1231 -0.0017 -0.3893 0.0415 -0.0859 -0.0648 0.3271 0.3747 -0.2872 0.1953 -0.0229 -0.1351 -0.2667 -0.0639 -0.1754 0.0654 -0.1780 -0.0362 -0.1134 -0.2017 -0.2801 0.1452 0.0794 0.0876 0.1305 0.1343 0.0838 0.0867 0.1072 0.0924 0.1343 0.0940 0.0802 0.1603 0.0756 0.0952 0.2093 0.1685 0.1719 0.1779 0.1724 0.1329 0.1291 0.1138
va: 2.1523 2.2715 2.0609 2.0290 3.0448 3.2563 3.1140 3.9017 3.8695 3.8866 4.2573 4.2558 3.9472 3.3953 3.8294 3.8857 3.9138 3.9111 3.9180 4.0419 3.8650 3.8942 4.0511 3.7842 3.9216 0.9915 1.0195 1.0160 1.0149 1.0013 1.0013 1.0065 1.0038 1.0060 1.0037 1.0120 1.0156 1.0131 1.0128 1.0059 0.9776 1.0002 0.9943 0.9885 0.9997 1.0018 1.0037 1.0100
dispcorr: -0.031273284 hartree
energy: -1165.046432491872
dipole: -2.72124 1.62054 -1.10070 -8.80270 9.20018 0.39748 4.14710 -3.48883 0.65827
magnitude: 1.34270 au
magnitude: 3.41288 debye
