program: Orca
programVersion: 4.2.1
elementType: O O O O N N N C C C C C C C C C C C C C C C C C C H H H H H H H H H H H H H H H H H H H H H H H
charge: 0
multiplicity: 1
keywords: wb97x-d3
keywords: def2-TZVPP
keywords: def2/J RIJCOSX GRIDX6 NOFINALGRIDX
keywords: grid4 nofinalgrid
keywords: scfconv7
keywords: smallprint printgap noloewdin
keywords: NOSOSCF
formula: C18H23N3O4
InChI: InChI=1/C18H23N3O4/c1-3-5-6-11-25-17(22)16(4-2)21(13-15-8-7-12-24-15)18(23)20-10-9-19-14-20/h3,7-10,12,14,16H,1,4-6,11,13H2,2H3
48 atoms
O  -0.174952 -1.177211 1.2036
O  -1.668866 -0.336749 -1.916056
O  -1.711018 -0.501101 2.677525
O  0.065261 2.582203 -1.692352
N  -0.555727 1.445413 0.172559
N  1.709939 1.825469 -0.331164
N  3.655443 0.86719 0.057623
C  -0.307841 1.135205 1.578559
C  -0.873723 2.194133 2.519103
C  -1.953485 1.415146 -0.259326
C  -0.831025 -0.265339 1.88802
C  0.34326 1.986447 -0.67277
C  -0.315544 3.577128 2.224591
C  -2.337344 0.096145 -0.820636
C  -0.51475 -2.56358 1.381172
C  0.55924 -3.38863 0.712847
C  -3.276941 -0.81136 -0.464842
C  0.634578 -3.213875 -0.804216
C  2.662976 2.808353 -0.476323
C  2.373583 0.674554 -0.019761
C  -3.181607 -1.879964 -1.408895
C  -2.187721 -1.538945 -2.258579
C  3.846611 2.199415 -0.214666
C  1.73771 -4.031708 -1.393714
C  2.796146 -3.53574 -2.02351
H  0.768454 1.101957 1.749189
H  -1.964479 2.215836 2.491639
H  -0.601783 1.900602 3.534524
H  -2.130028 2.215959 -0.976377
H  -2.599722 1.628707 0.590948
H  0.776334 3.582411 2.230132
H  -0.64914 3.963086 1.260111
H  -0.647335 4.286242 2.982308
H  -1.498031 -2.748554 0.941413
H  -0.563604 -2.79594 2.446073
H  0.348838 -4.434843 0.948629
H  1.526515 -3.160341 1.168736
H  -3.954048 -0.732529 0.370301
H  0.773516 -2.162943 -1.069173
H  -0.322292 -3.520317 -1.238544
H  2.413756 3.826068 -0.723332
H  1.868902 -0.268534 0.112987
H  -3.770903 -2.781667 -1.440868
H  -1.755438 -2.024292 -3.118383
H  4.827032 2.646693 -0.203335
H  1.655295 -5.108194 -1.267499
H  3.576524 -4.176089 -2.414176
H  2.926454 -2.468867 -2.168522
elementType: O N C H
totalener: -1165.01621391 hartree
nucrepener: 2387.86175235 hartree
electener: -3552.87796625 hartree
oneelecener: -6331.99603708 hartree
twoeener: 2779.11807083 hartree
cpcmener: -0.04210055 hartree
kineticenergy: 1160.03996527 hartree
xcener: -111.462700248881 hartree
chargesum: 0.0000000
charge: -0.249922 -0.286630 -0.441490 -0.473456 -0.100275 -0.020915 -0.386248 -0.022038 -0.102770 -0.056836 0.387091 0.367743 -0.292325 0.247104 -0.045898 -0.113747 -0.322626 -0.041176 -0.142664 0.071114 -0.171338 -0.051898 -0.109878 -0.213163 -0.284728 0.145406 0.075362 0.089241 0.136776 0.151496 0.090374 0.086913 0.108779 0.121466 0.127328 0.095310 0.081660 0.164029 0.066498 0.085955 0.189287 0.140502 0.172099 0.184477 0.169428 0.137310 0.132229 0.105046
qa: -0.2499 -0.2866 -0.4415 -0.4735 -0.1003 -0.0209 -0.3862 -0.0220 -0.1028 -0.0568 0.3871 0.3677 -0.2923 0.2471 -0.0459 -0.1137 -0.3226 -0.0412 -0.1427 0.0711 -0.1713 -0.0519 -0.1099 -0.2132 -0.2847 0.1454 0.0754 0.0892 0.1368 0.1515 0.0904 0.0869 0.1088 0.1215 0.1273 0.0953 0.0817 0.1640 0.0665 0.0860 0.1893 0.1405 0.1721 0.1845 0.1694 0.1373 0.1322 0.1050
va: 2.1413 2.2556 2.0479 2.0268 3.0767 3.2562 3.1104 3.9679 3.8882 3.8352 4.1823 4.2564 3.9577 3.3849 3.8648 3.8900 3.9427 3.8244 3.9255 4.0032 3.8518 3.8715 4.0219 3.8262 3.9362 0.9900 1.0146 1.0154 1.0215 0.9968 1.0007 1.0033 1.0056 0.9927 1.0094 1.0147 1.0199 1.0088 1.0149 1.0156 0.9942 1.0346 0.9940 0.9853 0.9980 1.0008 1.0030 1.0151
dispcorr: -0.029932994 hartree
energy: -1165.046146902340
dipole: 0.75254 -2.12760 -1.37506 -8.18752 7.51083 -0.67669 5.63569 -4.45364 1.18204
magnitude: 1.93544 au
magnitude: 4.91949 debye
