program: Orca
programVersion: 4.2.1
elementType: O O O O N N N C C C C C C C C C C C C C C C C C C H H H H H H H H H H H H H H H H H H H H H H H
charge: 0
multiplicity: 1
keywords: wb97x-d3
keywords: def2-TZVPP
keywords: def2/J RIJCOSX GRIDX6 NOFINALGRIDX
keywords: grid4 nofinalgrid
keywords: scfconv7
keywords: smallprint printgap noloewdin
keywords: NOSOSCF
formula: C18H23N3O4
InChI: InChI=1/C18H23N3O4/c1-3-5-6-11-25-17(22)16(4-2)21(13-15-8-7-12-24-15)18(23)20-10-9-19-14-20/h3,7-10,12,14,16H,1,4-6,11,13H2,2H3
48 atoms
O  0.6708 -1.508596 0.720817
O  -2.451775 0.23576 -1.48133
O  0.468092 -0.457199 -1.238712
O  -0.718977 2.708992 -1.97539
N  -0.286363 1.835913 0.086315
N  1.442684 2.59935 -1.305598
N  3.361615 2.63256 -2.384757
C  0.585012 0.868113 0.754648
C  0.324889 0.776858 2.259643
C  -1.722538 1.685411 0.341675
C  0.541333 -0.443953 -0.032452
C  0.057078 2.37037 -1.1096
C  1.543484 0.319934 3.049601
C  -2.275069 0.398167 -0.148593
C  0.699191 -2.801119 0.091013
C  1.135433 -3.813161 1.123856
C  -2.580761 -0.754524 0.496643
C  0.186087 -3.976636 2.310947
C  2.361081 3.159735 -0.444453
C  2.104603 2.309104 -2.457762
C  -2.962157 -1.693312 -0.507829
C  -2.858627 -1.035906 -1.684795
C  3.529714 3.17423 -1.134533
C  -1.145933 -4.529494 1.917614
C  -2.319983 -3.98005 2.202894
H  1.617838 1.206336 0.644687
H  0.05597 1.776454 2.606689
H  -0.525919 0.131443 2.481616
H  -2.242463 2.540237 -0.08715
H  -1.882239 1.741779 1.416774
H  2.391759 0.986049 2.88256
H  1.322107 0.335925 4.116466
H  1.855981 -0.690879 2.795276
H  1.399982 -2.790101 -0.745514
H  -0.297727 -3.023176 -0.298947
H  2.134678 -3.555165 1.482932
H  1.236786 -4.770393 0.605258
H  -2.533307 -0.919092 1.560621
H  0.061052 -3.03003 2.841917
H  0.65866 -4.666281 3.017245
H  2.100107 3.530262 0.532346
H  1.617067 1.846886 -3.300895
H  -3.262655 -2.718251 -0.367212
H  -3.045456 -1.324913 -2.706451
H  4.481849 3.554157 -0.801504
H  -1.12572 -5.464217 1.361775
H  -3.251041 -4.444558 1.904465
H  -2.396309 -3.052631 2.759285
elementType: O N C H
totalener: -1165.01483026 hartree
nucrepener: 2387.62843378 hartree
electener: -3552.64326405 hartree
oneelecener: -6332.25390872 hartree
twoeener: 2779.61064468 hartree
cpcmener: -0.04810315 hartree
kineticenergy: 1160.04613338 hartree
xcener: -111.465746155501 hartree
chargesum: 0.0000000
charge: -0.240984 -0.277593 -0.454249 -0.463123 -0.135620 -0.017322 -0.389366 0.107818 -0.089862 -0.074640 0.307146 0.385354 -0.304862 0.196982 -0.027778 -0.141884 -0.234591 -0.046786 -0.174856 0.060888 -0.227929 -0.009782 -0.110743 -0.170900 -0.324433 0.120649 0.091253 0.087052 0.128672 0.138107 0.086798 0.101419 0.088941 0.119062 0.114513 0.084635 0.086758 0.164107 0.069140 0.094607 0.201794 0.169311 0.170726 0.181591 0.170171 0.137950 0.135678 0.116180
qa: -0.2410 -0.2776 -0.4542 -0.4631 -0.1356 -0.0173 -0.3894 0.1078 -0.0899 -0.0746 0.3071 0.3854 -0.3049 0.1970 -0.0278 -0.1419 -0.2346 -0.0468 -0.1749 0.0609 -0.2279 -0.0098 -0.1107 -0.1709 -0.3244 0.1206 0.0913 0.0871 0.1287 0.1381 0.0868 0.1014 0.0889 0.1191 0.1145 0.0846 0.0868 0.1641 0.0691 0.0946 0.2018 0.1693 0.1707 0.1816 0.1702 0.1380 0.1357 0.1162
va: 2.1632 2.2817 2.0353 2.0342 3.0872 3.2624 3.1071 3.8915 3.8521 3.9082 4.1683 4.2714 3.9556 3.4934 3.8462 3.9363 3.8878 3.8514 3.9130 4.0359 3.8907 3.8815 4.0404 3.7530 3.9308 0.9903 1.0099 1.0091 1.0236 0.9953 1.0024 1.0007 1.0092 1.0102 0.9966 1.0139 1.0127 0.9984 1.0182 1.0059 0.9826 1.0038 0.9969 0.9861 1.0002 0.9994 1.0007 1.0064
dispcorr: -0.030000389 hartree
energy: -1165.044830653205
dipole: 0.49635 -0.94400 -0.44765 -21.08618 19.11815 -1.96803 23.39436 -19.53018 3.86417
magnitude: 4.35951 au
magnitude: 11.08100 debye
