program: Orca
programVersion: 4.2.1
elementType: O O O O N N N C C C C C C C C C C C C C C C C C C H H H H H H H H H H H H H H H H H H H H H H H
charge: 0
multiplicity: 1
keywords: wb97x-d3
keywords: def2-TZVPP
keywords: def2/J RIJCOSX GRIDX6 NOFINALGRIDX
keywords: grid4 nofinalgrid
keywords: scfconv7
keywords: smallprint printgap noloewdin
keywords: NOSOSCF
formula: C18H23N3O4
InChI: InChI=1/C18H23N3O4/c1-3-5-6-11-25-17(22)16(4-2)21(13-15-8-7-12-24-15)18(23)20-10-9-19-14-20/h3,7-10,12,14,16H,1,4-6,11,13H2,2H3
48 atoms
O  -0.025429 -0.916622 0.672082
O  -3.71731 0.459406 -0.128206
O  -1.766617 -0.59185 2.033913
O  0.378965 0.856187 -2.228152
N  -0.508691 1.629089 -0.276223
N  1.808947 1.32458 -0.543316
N  3.938102 0.81616 -0.289912
C  -0.51775 1.311876 1.157904
C  -1.395689 2.251208 1.973661
C  -1.818463 1.751099 -0.919439
C  -0.872816 -0.165996 1.347569
C  0.50788 1.226612 -1.081377
C  -1.053363 2.212358 3.456422
C  -2.618352 0.494352 -0.923162
C  -0.22674 -2.337551 0.614308
C  0.833568 -2.894142 -0.306521
C  -2.476029 -0.699648 -1.551666
C  2.235131 -2.818081 0.280925
C  2.337095 2.273379 0.308328
C  2.828032 0.480245 -0.873373
C  -3.551414 -1.523163 -1.104787
C  -4.267832 -0.766803 -0.241851
C  3.643976 1.939452 0.445161
C  3.342272 -3.202053 -0.647738
C  3.217605 -3.605404 -1.907876
H  0.500373 1.413022 1.53727
H  -1.236558 3.266583 1.605297
H  -2.453903 2.027153 1.833319
H  -1.662646 2.107616 -1.935147
H  -2.372688 2.538236 -0.409765
H  -0.013792 2.494444 3.630615
H  -1.679865 2.915442 4.004515
H  -1.210134 1.227536 3.894038
H  -1.226663 -2.544246 0.228148
H  -0.151831 -2.762635 1.618033
H  0.78104 -2.363394 -1.262271
H  0.57564 -3.93415 -0.519323
H  -1.694157 -0.966631 -2.243565
H  2.290475 -3.455874 1.17014
H  2.442446 -1.808984 0.65124
H  1.770947 3.105924 0.689538
H  2.692561 -0.358995 -1.537887
H  -3.759538 -2.541192 -1.391157
H  -5.159578 -0.953028 0.334451
H  4.393754 2.452783 1.024969
H  4.339133 -3.136699 -0.221557
H  4.087524 -3.865822 -2.49696
H  2.259022 -3.70359 -2.402141
elementType: O N C H
totalener: -1165.01558789 hartree
nucrepener: 2412.47280296 hartree
electener: -3577.48839085 hartree
oneelecener: -6381.68479596 hartree
twoeener: 2804.19640511 hartree
cpcmener: -0.03922603 hartree
kineticenergy: 1160.02912118 hartree
xcener: -111.463890375452 hartree
chargesum: -0.0000000
charge: -0.259447 -0.274590 -0.434167 -0.465413 -0.140633 0.007489 -0.384360 0.109352 -0.098346 -0.064582 0.298157 0.379440 -0.285518 0.205474 -0.058214 -0.108553 -0.280672 -0.072596 -0.163330 0.055213 -0.181553 -0.039499 -0.110147 -0.206118 -0.291469 0.124820 0.092768 0.078192 0.131309 0.133336 0.084516 0.100756 0.086760 0.131054 0.122011 0.061998 0.103193 0.163407 0.099576 0.086869 0.199546 0.159925 0.180312 0.178809 0.171114 0.133630 0.133467 0.106713
qa: -0.2594 -0.2746 -0.4342 -0.4654 -0.1406 0.0075 -0.3844 0.1094 -0.0983 -0.0646 0.2982 0.3794 -0.2855 0.2055 -0.0582 -0.1086 -0.2807 -0.0726 -0.1633 0.0552 -0.1816 -0.0395 -0.1101 -0.2061 -0.2915 0.1248 0.0928 0.0782 0.1313 0.1333 0.0845 0.1008 0.0868 0.1311 0.1220 0.0620 0.1032 0.1634 0.0996 0.0869 0.1995 0.1599 0.1803 0.1788 0.1711 0.1336 0.1335 0.1067
va: 2.1491 2.2719 2.0541 2.0263 3.0822 3.2612 3.0786 3.8820 3.8633 3.8922 4.2107 4.2477 3.9503 3.3778 3.9076 3.9033 3.9059 3.8091 3.9125 4.0081 3.8828 3.8832 4.0377 3.8349 3.9101 0.9994 1.0111 1.0196 1.0126 1.0025 1.0013 1.0012 1.0128 0.9920 1.0022 1.0192 1.0133 1.0126 1.0064 1.0102 0.9827 1.0098 0.9887 0.9877 0.9993 1.0019 1.0040 1.0142
dispcorr: -0.030683736 hartree
energy: -1165.046271625909
dipole: 3.46064 -4.67426 -1.21362 -7.77317 8.27407 0.50090 7.42911 -6.42295 1.00616
magnitude: 1.65412 au
magnitude: 4.20445 debye
