program: Orca
programVersion: 4.2.1
elementType: O O O O N N N C C C C C C C C C C C C C C C C C C H H H H H H H H H H H H H H H H H H H H H H H
charge: 0
multiplicity: 1
keywords: wb97x-d3
keywords: def2-TZVPP
keywords: def2/J RIJCOSX GRIDX6 NOFINALGRIDX
keywords: grid4 nofinalgrid
keywords: scfconv7
keywords: smallprint printgap noloewdin
keywords: NOSOSCF
formula: C18H23N3O4
InChI: InChI=1/C18H23N3O4/c1-3-5-6-11-25-17(22)16(4-2)21(13-15-8-7-12-24-15)18(23)20-10-9-19-14-20/h3,7-10,12,14,16H,1,4-6,11,13H2,2H3
48 atoms
O  -0.027759 -0.919492 0.649824
O  -3.724759 0.473762 -0.132207
O  -1.766433 -0.607881 2.017835
O  0.373976 0.864325 -2.231007
N  -0.510906 1.633476 -0.275499
N  1.806022 1.328249 -0.545992
N  3.934242 0.816935 -0.290992
C  -0.52034 1.304186 1.155974
C  -1.398696 2.23609 1.979819
C  -1.820755 1.761904 -0.916994
C  -0.8742 -0.175353 1.333599
C  0.504559 1.23269 -1.083651
C  -1.054865 2.186094 3.461902
C  -2.624909 0.507889 -0.926187
C  -0.2224 -2.340938 0.588504
C  0.860012 -2.895275 -0.307462
C  -2.488044 -0.683178 -1.56149
C  2.248288 -2.805755 0.308695
C  2.333099 2.272185 0.311571
C  2.824815 0.483964 -0.877139
C  -3.567687 -1.503993 -1.119962
C  -4.281261 -0.749155 -0.253337
C  3.639679 1.937219 0.448403
C  3.375287 -3.20916 -0.586952
C  3.277373 -3.647289 -1.8376
H  0.497645 1.402888 1.536498
H  -1.241449 3.254704 1.619634
H  -2.456802 2.012111 1.839033
H  -1.664653 2.122643 -1.931354
H  -2.372111 2.548687 -0.403334
H  -1.679841 2.886006 4.01583
H  -1.212355 1.198242 3.892362
H  -0.014706 2.465597 3.636901
H  -1.213127 -2.550958 0.18075
H  -0.168133 -2.765696 1.593639
H  0.823694 -2.371421 -1.267746
H  0.613035 -3.938341 -0.518044
H  -1.706734 -0.949826 -2.254135
H  2.284297 -3.42513 1.211908
H  2.447382 -1.789254 0.66228
H  1.766735 3.103265 0.695554
H  2.689597 -0.352162 -1.545451
H  -3.780942 -2.519204 -1.412512
H  -5.174569 -0.93401 0.321031
H  4.388653 2.447358 1.031957
H  4.36307 -3.127912 -0.142961
H  4.160057 -3.916504 -2.40337
H  2.329709 -3.757598 -2.350088
elementType: O N C H
totalener: -1165.01554144 hartree
nucrepener: 2411.27737868 hartree
electener: -3576.29292012 hartree
oneelecener: -6379.28947845 hartree
twoeener: 2802.99655833 hartree
cpcmener: -0.03908189 hartree
kineticenergy: 1160.02842257 hartree
xcener: -111.463664107829 hartree
chargesum: 0.0000000
charge: -0.258483 -0.275283 -0.434120 -0.465196 -0.141357 0.008087 -0.383859 0.106674 -0.097627 -0.064559 0.298714 0.380099 -0.285236 0.207201 -0.058175 -0.108589 -0.282349 -0.072269 -0.165267 0.055700 -0.180619 -0.039646 -0.109630 -0.204072 -0.292861 0.125506 0.091462 0.078706 0.131327 0.132970 0.100790 0.086788 0.084522 0.131146 0.120986 0.063398 0.102059 0.163365 0.099394 0.086727 0.200577 0.159294 0.180253 0.178914 0.171239 0.133677 0.133446 0.106178
qa: -0.2585 -0.2753 -0.4341 -0.4652 -0.1414 0.0081 -0.3839 0.1067 -0.0976 -0.0646 0.2987 0.3801 -0.2852 0.2072 -0.0582 -0.1086 -0.2823 -0.0723 -0.1653 0.0557 -0.1806 -0.0396 -0.1096 -0.2041 -0.2929 0.1255 0.0915 0.0787 0.1313 0.1330 0.1008 0.0868 0.0845 0.1311 0.1210 0.0634 0.1021 0.1634 0.0994 0.0867 0.2006 0.1593 0.1803 0.1789 0.1712 0.1337 0.1334 0.1062
va: 2.1491 2.2715 2.0545 2.0265 3.0803 3.2611 3.0780 3.8843 3.8635 3.8917 4.2094 4.2475 3.9506 3.3750 3.9078 3.9068 3.9065 3.8094 3.9119 4.0101 3.8837 3.8834 4.0369 3.8342 3.9103 0.9992 1.0115 1.0197 1.0126 1.0026 1.0013 1.0129 1.0013 0.9917 1.0027 1.0189 1.0134 1.0129 1.0063 1.0100 0.9824 1.0089 0.9886 0.9877 0.9992 1.0018 1.0040 1.0143
dispcorr: -0.030628875 hartree
energy: -1165.046170310566
dipole: 3.58161 -4.78807 -1.20645 -7.86893 8.37832 0.50938 7.58849 -6.58462 1.00387
magnitude: 1.65008 au
magnitude: 4.19417 debye
