program: Gaussian 09
title: 000068398
version: EM64L-G09RevD.01
frameworkgroup: C1[X(C5H12O4S)]
method: RPBEPBE
basis: SDD
operation: Freq
keyword: #p
keyword: freq=noraman
keyword: PBEPBE/SDD
title: #p freq=noraman PBEPBE/SDD
converged: YES YES NO NO
title: Mulliken charges:
elementType: S O O O O C C C C C H H H H H H H H H H H H
charge: 1.199592 -0.440619 -0.543172 -0.449538 -0.471710 -0.346212 -0.373272 -0.346567 -0.281092 -0.688317 0.194819 0.194753 0.223484 0.216014 0.199888 0.199029 0.240139 0.226776 0.211869 0.212123 0.221682 0.400330
chargesum: 0.00000
title: Mulliken charges with hydrogens summed into heavy atoms:
elementType: S O O O O C C C C C
charge: 1.199592 -0.440619 -0.142841 -0.449538 -0.471710 0.043360 0.066226 0.052351 0.185823 -0.042643
polarizability: 1.44738678e+02 -8.68885294e-01 8.59934197e+01 2.50964260e+00 -7.48677304e-01 8.05517204e+01
1716.lowfreq: -9.0779 -1.5280 -0.0005 0.0019 0.0021 9.1988 26.1209 48.5137 60.0559
frequency: 25.8600 47.3961 59.9544 71.5813 106.0675 118.3919 134.2520 157.1151 193.0528 222.7445 227.7235 278.2787 320.7142 331.1650 356.7236 406.6875 438.1663 563.5344 575.9559 735.6665 776.3312 857.7766 867.0245 876.1891 916.1195 973.5873 992.7412 1010.1740 1052.3473 1070.0482 1105.7323 1116.9123 1148.9519 1200.6194 1253.8290 1258.0908 1280.3475 1292.5907 1317.6653 1348.8008 1358.5932 1390.4115 1467.5466 1469.0449 1476.2958 1476.6118 1484.7111 1491.5030 2965.8013 2975.8910 2976.1625 2988.7050 3002.7308 3007.3282 3032.5349 3051.5403 3072.3773 3076.9372 3079.9553 3459.5638
redmass: 5.9673 1.9001 4.5400 3.7194 1.7520 2.2118 2.3893 3.2255 4.7477 1.1871 3.4685 2.3906 10.2568 7.2299 7.7561 3.9398 4.7356 8.1600 16.1669 1.0712 1.1049 1.1853 9.6363 2.9071 3.2159 1.1642 10.3093 4.0702 2.8161 2.6972 1.3600 2.0569 1.3989 1.4628 1.2735 1.2341 1.0819 1.0977 1.3252 1.5507 1.2979 1.2114 1.0708 1.0694 1.0460 1.0597 1.0789 1.0932 1.0582 1.0581 1.0377 1.0553 1.0581 1.0991 1.1031 1.1068 1.1022 1.0992 1.1074 1.0654
irintensity: 0.4575 0.9671 2.9541 2.7158 0.5724 50.0803 0.3368 22.7734 9.1357 1.5107 14.4121 29.9732 17.5576 17.0957 26.3967 12.4468 20.7366 43.4762 135.9524 11.3667 0.2128 2.6042 104.7151 28.8901 43.0359 0.2145 94.7569 9.0688 5.9956 4.2634 139.0484 12.4441 1.7498 0.4904 7.3479 0.8151 0.0292 1.0148 2.3134 0.3977 4.1379 10.1773 4.2188 0.0704 12.5605 11.0790 2.7157 28.7971 1.3420 59.4221 29.9484 22.6642 45.0689 0.5831 18.4526 0.9013 29.1834 45.9712 106.6010 60.9418
temp: 298.150 k
press: 1.00000 atm
elementType: 16 8 8 8 8 6 6 6 6 6 1 1 1 1 1 1 1 1 1 1 1 1
symmnumber: 1
zpe: 450939.2 jmol-1
zpe.correction: 0.171754 hartree
zpe.thermalcorrener: 0.185566 hartree
zpe.thermalcorrenthalpy: 0.186510 hartree
zpe.thermalcorrgfe: 0.129405 hartree
zpe.sumelectzpe: -895.643414 hartree
zpe.sumelectthermal: -895.629602 hartree
zpe.sumelectthermalent: -895.628657 hartree
zpe.sumelectthermalfe: -895.685762 hartree
dipole: -5.4311 1.3118 -0.6324
dipole: 5.6229
quadrupole: -80.7798 -68.0253 -72.8498
quadrupole: 3.5053 -2.1961 -2.8214
quadrupole: -6.8948 5.8597 1.0351 3.5053 -2.1961 -2.8214
hfenergy: -895.8151672 hartree
pointgroup: C01 [X(C5H12O4S1)]
dipole: -2.129163 0.5364051 -0.2699707 debye
dipolederiv: 1.8602414 0.0230883 0.0122199 -0.2339808 1.6737885 -0.0621811 -0.0454337 -0.0325578 1.4652108 -0.8349704 -0.1141188 0.0324579 0.0009012 -0.4625208 -0.0068547 0.010585 -0.0114572 -0.4419789 -0.4409315 -0.0582804 0.0481675 -0.3841891 -0.9049132 0.0954785 0.1760508 0.1022264 -0.5779836 -0.6158302 0.0484007 -0.0601158 0.1274082 -0.4558102 0.0164758 -0.1740002 0.0506559 -0.551273 -0.569755 0.0084488 -0.0225911 0.1451507 -0.5245304 -0.0590515 0.1142558 -0.1185996 -0.568703 0.0253449 0.0260171 -0.0029005 0.3949546 0.0660689 -0.00811 0.0149029 -0.0076975 0.1852532 -0.2247793 -0.0180626 -0.0037341 -0.4912223 0.0833858 0.0082364 -0.0420195 0.0029811 0.1613612 0.0173297 -0.0167782 -0.0043385 -0.2557135 0.1032303 -0.0050687 -0.021304 -0.0048468 0.1748036 0.5133732 0.1049916 -0.0095367 0.6301882 0.2571525 -0.0513019 0.0435304 -0.0165941 0.3083023 -0.1093309 -0.0361135 -0.0076386 0.0947509 0.0485727 -0.0029675 -0.0030583 -0.0041168 0.093141 0.0337097 -0.0011155 -0.0025112 -0.0203898 -0.050607 0.1123545 0.0095521 0.1378409 -0.0657953 0.0300487 0.0089964 0.0125996 -0.0111636 -0.0221758 -0.1074882 -0.0024463 -0.1316093 -0.0932142 0.0879446 0.0006768 0.0026635 0.0110196 0.003811 -0.087515 0.002603 -0.1063309 -0.0669533 0.0822356 -0.0068043 0.003679 0.0044953 -0.0292233 0.0996716 0.0103966 0.1153333 -0.0452849 0.0331119 -0.0176855 -0.0259428 0.0109587 -0.0251189 -0.1145937 0.0022365 -0.1440099 -0.1001043 0.028867 -0.0319938 0.031464 0.0019733 -0.0555526 0.1200798 0.0068594 0.1477816 -0.0681433 0.0160806 0.0080118 0.0272827 -0.0907044 0.0132818 -0.0570875 -0.0077982 -0.0904622 -0.050829 -0.0142193 -0.011093 -0.0114824 -0.0910038 -0.0291257 0.0812503 0.002232 0.1135533 -0.0471184 0.0851644 0.0021383 0.0292972 -0.046794 0.0016311 -0.1166986 -0.0241691 -0.1303509 -0.0988129 0.084733 -0.0058158 -0.0169627 -0.0591645 -0.0262642 0.1210586 0.0314878 0.1383195 -0.0705427 -0.1838845 0.0986517 -0.00399 0.1101375 0.0038752 -0.0003947 -0.0049493 -0.001563 0.103287 0.0955163 -0.01156 -0.0280869 0.1523876 0.3310442 0.0247077 -0.0995136 -0.008496 0.3553776 unknown
polarizability: 144.6580741|-1.410039|86.0178987|3.1718675|-0.7747392|80.6078453 unknown
InChI: InChI=1S/C5H12O4S/c1-2-3-4-5-9-10(6,7)8/h6H,2-5H2,1H3
charge 0 multiplicity 1
22 atoms
S  2.796203 -0.221207 0.043456
O  1.111308 0.555081 0.210426
O  3.529264 1.402849 -0.315044
O  3.402183 -0.727481 1.433204
O  2.806658 -1.180803 -1.244536
C  -2.577603 -0.336669 -0.008322
C  -1.28276 0.508985 0.093593
C  -3.850485 0.54174 -0.006552
C  -0.035162 -0.386206 0.081659
C  -5.145694 -0.292887 -0.102706
H  -2.625362 -1.050099 0.839656
H  -2.555399 -0.946495 -0.934664
H  -1.294195 1.10354 1.026167
H  -1.230027 1.220274 -0.75223
H  -3.869798 1.154381 0.917212
H  -3.803513 1.254369 -0.854515
H  0.049196 -0.950092 -0.866717
H  -0.038066 -1.084446 0.939898
H  -5.164259 -0.893081 -1.031725
H  -5.233336 -0.991393 0.750528
H  -6.041028 0.35497 -0.101581
H  2.757673 1.98997 -0.573706
