program: Orca
programVersion: 4.2.1
elementType: O O O O N N N C C C C C C C C C C C C C C C C C C H H H H H H H H H H H H H H H H H H H H H H H
charge: 0
multiplicity: 1
keywords: wb97x-d3
keywords: def2-TZVPP
keywords: def2/J RIJCOSX GRIDX6 NOFINALGRIDX
keywords: grid4 nofinalgrid
keywords: scfconv7
keywords: smallprint printgap noloewdin
keywords: NOSOSCF
formula: C18H23N3O4
InChI: InChI=1/C18H23N3O4/c1-3-5-6-11-25-17(22)16(4-2)21(13-15-8-7-12-24-15)18(23)20-10-9-19-14-20/h3,7-10,12,14,16H,1,4-6,11,13H2,2H3
48 atoms
O  1.139558 -1.520211 1.016756
O  -2.280363 -0.236841 -1.468581
O  0.528013 -0.957502 -1.05774
O  -0.405152 3.678378 -1.098718
N  -0.142381 1.608809 -0.190164
N  1.654041 2.750958 -1.195387
N  3.6112 3.669327 -1.624206
C  0.720698 0.762089 0.625547
C  0.430225 0.904002 2.12346
C  -1.585376 1.513476 0.058865
C  0.742908 -0.668021 0.093023
C  0.290452 2.722717 -0.818653
C  0.518658 2.350571 2.585475
C  -2.125869 0.156148 -0.181684
C  1.359503 -2.896008 0.652745
C  0.090917 -3.718798 0.705996
C  -2.545479 -0.826414 0.651915
C  -0.558381 -3.730855 2.08086
C  2.431098 1.763056 -1.765749
C  2.419625 3.878876 -1.152789
C  -2.976503 -1.904463 -0.17918
C  -2.783622 -1.491248 -1.451666
C  3.624771 2.353868 -2.019888
C  -1.762024 -4.608158 2.213444
C  -2.325591 -5.336795 1.255994
H  1.751979 1.102328 0.497242
H  -0.53742 0.473458 2.387646
H  1.177548 0.320906 2.660111
H  -2.089768 2.23053 -0.585453
H  -1.816461 1.80815 1.084072
H  -0.252282 2.988199 2.149635
H  0.403359 2.405296 3.667755
H  1.489047 2.786629 2.337848
H  2.081836 -3.255994 1.384824
H  1.823652 -2.951578 -0.33234
H  0.376281 -4.735797 0.420955
H  -0.616503 -3.372197 -0.050717
H  -2.553598 -0.788263 1.729669
H  -0.848529 -2.715728 2.372542
H  0.176486 -4.040841 2.832944
H  2.062313 0.775287 -1.980094
H  2.053827 4.806659 -0.7430
H  -3.365784 -2.858914 0.135004
H  -2.961885 -1.952585 -2.409699
H  4.49172 1.904768 -2.476726
H  -2.204461 -4.628071 3.205238
H  -3.202822 -5.938074 1.457811
H  -1.946555 -5.368162 0.241911
elementType: O N C H
totalener: -1165.01684391 hartree
nucrepener: 2358.05336224 hartree
electener: -3523.07020615 hartree
oneelecener: -6272.38883832 hartree
twoeener: 2749.31863217 hartree
cpcmener: -0.04286726 hartree
kineticenergy: 1160.01544360 hartree
xcener: -111.466498429304 hartree
chargesum: -0.0000000
charge: -0.277896 -0.283531 -0.458429 -0.483525 -0.094372 -0.028848 -0.388056 0.005546 -0.086638 -0.084323 0.383759 0.392044 -0.294499 0.178383 -0.010859 -0.104576 -0.251678 -0.065009 -0.184778 0.069345 -0.221965 -0.018103 -0.108468 -0.181185 -0.319095 0.141231 0.080086 0.089336 0.131942 0.143375 0.082610 0.109544 0.093481 0.116625 0.114223 0.098534 0.073360 0.170025 0.076586 0.091936 0.208866 0.172831 0.192677 0.181576 0.171922 0.133155 0.134423 0.108410
qa: -0.2779 -0.2835 -0.4584 -0.4835 -0.0944 -0.0288 -0.3881 0.0055 -0.0866 -0.0843 0.3838 0.3920 -0.2945 0.1784 -0.0109 -0.1046 -0.2517 -0.0650 -0.1848 0.0693 -0.2220 -0.0181 -0.1085 -0.1812 -0.3191 0.1412 0.0801 0.0893 0.1319 0.1434 0.0826 0.1095 0.0935 0.1166 0.1142 0.0985 0.0734 0.1700 0.0766 0.0919 0.2089 0.1728 0.1927 0.1816 0.1719 0.1332 0.1344 0.1084
va: 2.1517 2.2626 2.0179 2.0206 3.0828 3.2644 3.1142 3.9399 3.8756 3.9011 4.1309 4.2406 3.9487 3.5021 3.8862 3.8149 3.8882 3.8359 3.9184 4.0227 3.8907 3.8777 4.0574 3.8047 3.9116 0.9892 1.0108 1.0223 1.0305 0.9939 1.0080 1.0035 1.0010 0.9972 1.0134 1.0118 1.0292 0.9970 1.0097 1.0082 0.9988 1.0004 0.9795 0.9874 1.0002 1.0003 1.0046 1.0126
dispcorr: -0.029543506 hartree
energy: -1165.046387415627
dipole: -4.37123 3.86785 -0.50338 -19.72872 16.90200 -2.82672 18.56769 -15.80731 2.76038
magnitude: 3.98289 au
magnitude: 10.12371 debye
