program: Orca
programVersion: 4.2.1
elementType: O O O O N N N C C C C C C C C C C C C C C C C C C H H H H H H H H H H H H H H H H H H H H H H H
charge: 0
multiplicity: 1
keywords: wb97x-d3
keywords: def2-TZVPP
keywords: def2/J RIJCOSX GRIDX6 NOFINALGRIDX
keywords: grid4 nofinalgrid
keywords: scfconv7
keywords: smallprint printgap noloewdin
keywords: NOSOSCF
formula: C18H23N3O4
InChI: InChI=1/C18H23N3O4/c1-3-5-6-11-25-17(22)16(4-2)21(13-15-8-7-12-24-15)18(23)20-10-9-19-14-20/h3,7-10,12,14,16H,1,4-6,11,13H2,2H3
48 atoms
O  0.230225 -0.925928 0.739121
O  -1.765143 -0.31367 -1.828112
O  -0.911949 -0.538213 2.618319
O  -0.279769 2.892091 -1.883494
N  -0.525515 1.663692 0.010629
N  1.602558 2.306465 -0.767894
N  3.681664 1.585362 -0.703185
C  -0.048409 1.328056 1.348754
C  -0.610668 2.250921 2.427435
C  -1.959106 1.501284 -0.230303
C  -0.314457 -0.144884 1.650738
C  0.191983 2.312871 -0.930975
C  -0.309363 3.714529 2.149976
C  -2.310469 0.129198 -0.6750
C  0.054773 -2.345508 0.864213
C  0.723834 -2.993325 -0.328685
C  -3.116553 -0.823767 -0.148797
C  0.372439 -4.477586 -0.457353
C  2.402803 3.405008 -0.984699
C  2.435042 1.233663 -0.620437
C  -3.059672 -1.935217 -1.045111
C  -2.220055 -1.567289 -2.038956
C  3.676249 2.939295 -0.918217
C  0.788101 -5.302211 0.720688
C  1.756338 -6.210485 0.70136
H  1.035818 1.445714 1.372104
H  -1.684023 2.105211 2.562309
H  -0.148657 1.960021 3.372445
H  -2.283171 2.242294 -0.959752
H  -2.510667 1.717928 0.684026
H  0.760133 3.888221 2.013537
H  -0.825649 4.087047 1.263974
H  -0.632419 4.331211 2.988719
H  -1.013056 -2.577302 0.885832
H  0.495539 -2.68016 1.805981
H  1.808598 -2.876636 -0.259515
H  0.401951 -2.484218 -1.240362
H  -3.67941 -0.748395 0.767953
H  0.842373 -4.867402 -1.362718
H  -0.709631 -4.568286 -0.601983
H  2.001333 4.391957 -1.140074
H  2.064312 0.230785 -0.480539
H  -3.569618 -2.880391 -0.952803
H  -1.87245 -2.06572 -2.929706
H  4.58994 3.504607 -1.012168
H  0.250835 -5.13485 1.650657
H  2.020969 -6.776472 1.585687
H  2.321315 -6.424877 -0.199228
elementType: O N C H
totalener: -1165.02424416 hartree
nucrepener: 2347.56179779 hartree
electener: -3512.58604195 hartree
oneelecener: -6251.06610065 hartree
twoeener: 2738.48005869 hartree
cpcmener: -0.03542679 hartree
kineticenergy: 1160.03748136 hartree
xcener: -111.461465118885 hartree
chargesum: -0.0000000
charge: -0.257419 -0.276714 -0.415779 -0.446891 -0.104912 -0.029486 -0.375248 -0.019316 -0.112662 -0.064872 0.368415 0.361574 -0.284667 0.235130 -0.051128 -0.123513 -0.305216 -0.087398 -0.139415 0.030893 -0.173969 -0.050882 -0.107480 -0.191301 -0.280564 0.139292 0.076395 0.089124 0.135224 0.151035 0.089144 0.085800 0.107378 0.121516 0.129679 0.099178 0.093551 0.160895 0.082218 0.086064 0.184713 0.181251 0.168186 0.178944 0.165480 0.138895 0.128709 0.110150
qa: -0.2574 -0.2767 -0.4158 -0.4469 -0.1049 -0.0295 -0.3752 -0.0193 -0.1127 -0.0649 0.3684 0.3616 -0.2847 0.2351 -0.0511 -0.1235 -0.3052 -0.0874 -0.1394 0.0309 -0.1740 -0.0509 -0.1075 -0.1913 -0.2806 0.1393 0.0764 0.0891 0.1352 0.1510 0.0891 0.0858 0.1074 0.1215 0.1297 0.0992 0.0936 0.1609 0.0822 0.0861 0.1847 0.1813 0.1682 0.1789 0.1655 0.1389 0.1287 0.1101
va: 2.1364 2.2626 2.0840 2.0610 3.0718 3.2607 3.1130 3.9564 3.8947 3.8463 4.2334 4.2706 3.9562 3.4082 3.8233 3.8608 3.9344 3.9052 3.9235 4.0151 3.8424 3.8597 4.0184 3.7997 3.9357 0.9887 1.0116 1.0161 1.0238 0.9929 1.0011 1.0037 1.0061 0.9899 1.0066 1.0156 1.0110 1.0075 1.0142 1.0095 0.9957 1.0100 0.9958 0.9892 0.9992 0.9952 1.0030 1.0117
dispcorr: -0.028760138 hartree
energy: -1165.053004297015
dipole: -0.58668 -0.66088 -1.24756 -13.09602 12.51393 -0.58209 9.09391 -8.18209 0.91182
magnitude: 1.65125 au
magnitude: 4.19715 debye
