program: Orca
programVersion: 4.2.1
elementType: O O O O N N N C C C C C C C C C C C C C C C C C C H H H H H H H H H H H H H H H H H H H H H H H
charge: 0
multiplicity: 1
keywords: wb97x-d3
keywords: def2-TZVPP
keywords: def2/J RIJCOSX GRIDX6 NOFINALGRIDX
keywords: grid4 nofinalgrid
keywords: scfconv7
keywords: smallprint printgap noloewdin
keywords: NOSOSCF
formula: C18H23N3O4
InChI: InChI=1/C18H23N3O4/c1-3-5-6-11-25-17(22)16(4-2)21(13-15-8-7-12-24-15)18(23)20-10-9-19-14-20/h3,7-10,12,14,16H,1,4-6,11,13H2,2H3
48 atoms
O  0.159678 -0.784606 0.928282
O  -3.527603 0.256333 -0.117739
O  -1.633198 -0.387799 2.199419
O  0.655184 0.798541 -2.172778
N  -0.437227 1.613935 -0.346546
N  1.905994 1.54279 -0.438831
N  4.032664 1.259365 0.053506
C  -0.490262 1.462438 1.109956
C  -1.458483 2.43119 1.778714
C  -1.715254 1.571213 -1.059058
C  -0.754434 -0.00222 1.473839
C  0.663537 1.270293 -1.058245
C  -1.154556 2.611078 3.259547
C  -2.441481 0.278054 -0.925784
C  0.095634 -2.194296 1.198117
C  1.249004 -2.863024 0.487187
C  -2.223455 -0.963498 -1.427233
C  1.129102 -2.856634 -1.037006
C  2.288533 2.651042 0.287225
C  3.006939 0.74862 -0.555434
C  -3.237047 -1.80326 -0.878746
C  -3.994742 -1.005614 -0.090383
C  3.600142 2.451612 0.575518
C  2.334453 -3.444732 -1.697333
C  2.330707 -4.52098 -2.474527
H  0.502318 1.675167 1.510555
H  -1.36275 3.398875 1.280673
H  -2.493126 2.110941 1.65045
H  -1.524104 1.789989 -2.107083
H  -2.338666 2.385326 -0.689487
H  -1.848762 3.323515 3.705027
H  -1.242624 1.679359 3.816931
H  -0.145492 2.998533 3.412447
H  -0.863779 -2.589787 0.855949
H  0.164372 -2.358176 2.275399
H  1.288265 -3.896622 0.839559
H  2.187953 -2.398799 0.803779
H  -1.433661 -1.246277 -2.104041
H  0.993928 -1.831067 -1.393667
H  0.233399 -3.408586 -1.335289
H  1.627014 3.476929 0.488343
H  2.983719 -0.191766 -1.083363
H  -3.380612 -2.857922 -1.050372
H  -4.866917 -1.185917 0.517656
H  4.259442 3.107496 1.122065
H  3.278607 -2.93844 -1.508485
H  3.240232 -4.898208 -2.925105
H  1.418418 -5.064987 -2.693187
elementType: O N C H
totalener: -1165.02318178 hartree
nucrepener: 2401.89768207 hartree
electener: -3566.92086384 hartree
oneelecener: -6360.22934662 hartree
twoeener: 2793.30848278 hartree
cpcmener: -0.03309777 hartree
kineticenergy: 1160.03283488 hartree
xcener: -111.458894065157 hartree
chargesum: 0.0000000
charge: -0.261291 -0.267235 -0.410698 -0.438000 -0.123013 0.007955 -0.380117 0.104687 -0.089622 -0.069878 0.282638 0.343402 -0.286108 0.210007 -0.042066 -0.110308 -0.283375 -0.081454 -0.174243 0.064437 -0.177869 -0.031448 -0.102460 -0.187086 -0.282786 0.120528 0.089041 0.080199 0.131208 0.132720 0.099147 0.089992 0.081851 0.109800 0.123977 0.090285 0.078386 0.162492 0.073661 0.084020 0.197224 0.160219 0.173217 0.173487 0.167354 0.129064 0.129178 0.108883
qa: -0.2613 -0.2672 -0.4107 -0.4380 -0.1230 0.0080 -0.3801 0.1047 -0.0896 -0.0699 0.2826 0.3434 -0.2861 0.2100 -0.0421 -0.1103 -0.2834 -0.0815 -0.1742 0.0644 -0.1779 -0.0314 -0.1025 -0.1871 -0.2828 0.1205 0.0890 0.0802 0.1312 0.1327 0.0991 0.0900 0.0819 0.1098 0.1240 0.0903 0.0784 0.1625 0.0737 0.0840 0.1972 0.1602 0.1732 0.1735 0.1674 0.1291 0.1292 0.1089
va: 2.1489 2.2837 2.0826 2.0563 3.0793 3.2484 3.1134 3.9027 3.8528 3.8892 4.2212 4.2816 3.9526 3.3943 3.8805 3.8829 3.9140 3.8513 3.9135 4.0410 3.8809 3.8860 4.0425 3.8177 3.9594 1.0009 1.0111 1.0206 1.0152 1.0025 1.0019 1.0120 1.0014 0.9960 1.0055 1.0200 1.0193 1.0066 1.0117 1.0184 0.9842 1.0039 0.9921 0.9895 1.0004 1.0030 1.0034 1.0131
dispcorr: -0.030421019 hartree
energy: -1165.053602794387
dipole: 0.66766 -2.04814 -1.38049 -8.39609 8.85599 0.45989 5.30472 -4.50470 0.80002
magnitude: 1.66050 au
magnitude: 4.22066 debye
