program: Orca
programVersion: 4.2.1
elementType: O O O O N N N C C C C C C C C C C C C C C C C C C H H H H H H H H H H H H H H H H H H H H H H H
charge: 0
multiplicity: 1
keywords: wb97x-d3
keywords: def2-TZVPP
keywords: def2/J RIJCOSX GRIDX6 NOFINALGRIDX
keywords: grid4 nofinalgrid
keywords: scfconv7
keywords: smallprint printgap noloewdin
keywords: NOSOSCF
formula: C18H23N3O4
InChI: InChI=1/C18H23N3O4/c1-3-5-6-11-25-17(22)16(4-2)21(13-15-8-7-12-24-15)18(23)20-10-9-19-14-20/h3,7-10,12,14,16H,1,4-6,11,13H2,2H3
48 atoms
O  -0.17623 -1.175034 1.189415
O  -1.667675 -0.334816 -1.908582
O  -1.694142 -0.510322 2.686984
O  0.074601 2.532589 -1.712842
N  -0.555783 1.451286 0.179516
N  1.716376 1.82017 -0.322888
N  3.671631 0.87724 0.048019
C  -0.310298 1.137459 1.583556
C  -0.883967 2.185261 2.532871
C  -1.950828 1.420786 -0.258182
C  -0.826602 -0.266999 1.889407
C  0.349743 1.966223 -0.679125
C  -0.334755 3.57511 2.254753
C  -2.340274 0.104294 -0.823555
C  -0.503201 -2.561097 1.382817
C  0.571465 -3.388402 0.717428
C  -3.301475 -0.787796 -0.483953
C  0.642591 -3.225272 -0.801396
C  2.664145 2.80081 -0.50833
C  2.391173 0.675619 -0.00379
C  -3.213347 -1.851273 -1.433735
C  -2.200114 -1.522033 -2.265971
C  3.855431 2.202125 -0.253069
C  1.749644 -4.040891 -1.387602
C  2.809805 -3.543701 -2.013024
H  0.76607 1.112254 1.755026
H  -1.975146 2.199628 2.504705
H  -0.614092 1.883465 3.546771
H  -2.122116 2.222259 -0.976454
H  -2.599915 1.634459 0.589991
H  0.757383 3.5868 2.255368
H  -0.674316 3.972427 1.296961
H  -0.665991 4.273326 3.02332
H  -1.488514 -2.760251 0.953868
H  -0.543595 -2.783511 2.450686
H  0.364777 -4.433657 0.962838
H  1.540139 -3.154833 1.168594
H  -3.989592 -0.701001 0.341711
H  0.773998 -2.175096 -1.072831
H  -0.31368 -3.540365 -1.231674
H  2.405879 3.811317 -0.775942
H  1.889766 -0.264444 0.161297
H  -3.820652 -2.740536 -1.482036
H  -1.766384 -2.008221 -3.125073
H  4.835883 2.651149 -0.267496
H  1.668856 -5.117923 -1.261463
H  3.591034 -4.184603 -2.402207
H  2.94132 -2.476898 -2.159069
elementType: O N C H
totalener: -1165.02482663 hartree
nucrepener: 2385.34886597 hartree
electener: -3550.37369261 hartree
oneelecener: -6326.93580876 hartree
twoeener: 2776.56211615 hartree
cpcmener: -0.03517558 hartree
kineticenergy: 1160.04416079 hartree
xcener: -111.461206074430 hartree
chargesum: -0.0000000
charge: -0.253324 -0.276223 -0.416045 -0.444781 -0.101008 -0.023535 -0.377881 -0.022878 -0.104404 -0.055200 0.372195 0.355005 -0.290236 0.245238 -0.041309 -0.116591 -0.322358 -0.037951 -0.140147 0.065168 -0.169357 -0.054311 -0.107937 -0.211222 -0.275660 0.139989 0.074749 0.088164 0.135402 0.148670 0.089408 0.086653 0.107834 0.117173 0.124633 0.094312 0.082336 0.160697 0.065520 0.082056 0.184152 0.141615 0.168598 0.180012 0.166013 0.133766 0.128852 0.104145
qa: -0.2533 -0.2762 -0.4160 -0.4448 -0.1010 -0.0235 -0.3779 -0.0229 -0.1044 -0.0552 0.3722 0.3550 -0.2902 0.2452 -0.0413 -0.1166 -0.3224 -0.0380 -0.1401 0.0652 -0.1694 -0.0543 -0.1079 -0.2112 -0.2757 0.1400 0.0747 0.0882 0.1354 0.1487 0.0894 0.0867 0.1078 0.1172 0.1246 0.0943 0.0823 0.1607 0.0655 0.0821 0.1842 0.1416 0.1686 0.1800 0.1660 0.1338 0.1289 0.1041
va: 2.1351 2.2687 2.0800 2.0627 3.0683 3.2551 3.1151 3.9651 3.8907 3.8393 4.2015 4.2729 3.9573 3.3937 3.8669 3.8886 3.9505 3.8235 3.9268 4.0019 3.8581 3.8786 4.0218 3.8311 3.9400 0.9914 1.0145 1.0157 1.0208 0.9960 1.0007 1.0030 1.0058 0.9938 1.0099 1.0147 1.0195 1.0092 1.0165 1.0166 0.9964 1.0340 0.9954 0.9872 0.9989 1.0015 1.0038 1.0153
dispcorr: -0.029722494 hartree
energy: -1165.054549126094
dipole: 0.67255 -2.03379 -1.36124 -8.14128 7.56125 -0.58002 5.72073 -4.61850 1.10223
magnitude: 1.84508 au
magnitude: 4.68982 debye
