program: Orca
programVersion: 4.2.1
elementType: O O O O N N N C C C C C C C C C C C C C C C C C C H H H H H H H H H H H H H H H H H H H H H H H
charge: 0
multiplicity: 1
keywords: wb97x-d3
keywords: def2-TZVPP
keywords: def2/J RIJCOSX GRIDX6 NOFINALGRIDX
keywords: grid4 nofinalgrid
keywords: scfconv7
keywords: smallprint printgap noloewdin
keywords: NOSOSCF
formula: C18H23N3O4
InChI: InChI=1/C18H23N3O4/c1-3-5-6-11-25-17(22)16(4-2)21(13-15-8-7-12-24-15)18(23)20-10-9-19-14-20/h3,7-10,12,14,16H,1,4-6,11,13H2,2H3
48 atoms
O  1.197398 -1.609476 -0.178699
O  -2.376294 2.412767 0.762734
O  0.214234 -2.604738 -1.929708
O  1.285106 0.591694 -2.120433
N  -0.229145 0.602167 -0.445996
N  1.295259 2.381242 -0.73087
N  1.409134 4.515868 -0.20122
C  -0.792161 -0.634955 -0.976301
C  -1.610722 -0.456182 -2.253413
C  -0.49899 0.877456 0.966978
C  0.271531 -1.720618 -1.114784
C  0.791844 1.128727 -1.151347
C  -2.739164 0.550681 -2.1000
C  -1.917035 1.228546 1.223728
C  2.299254 -2.530033 -0.129265
C  2.216078 -3.39837 1.106916
C  -2.919571 0.559836 1.843633
C  1.013349 -4.328084 1.12778
C  2.621334 2.740104 -0.835187
C  0.61195 3.504597 -0.356759
C  -4.076736 1.391397 1.750214
C  -3.684276 2.49845 1.08098
C  2.667701 4.04935 -0.484191
C  0.952505 -5.262431 2.29519
C  1.826005 -5.352363 3.291779
H  -1.484997 -1.003488 -0.211143
H  -0.968246 -0.176044 -3.088306
H  -2.034245 -1.429633 -2.504091
H  0.173379 1.653233 1.329661
H  -0.262389 -0.016782 1.548118
H  -3.337311 0.57896 -3.011534
H  -3.409306 0.287689 -1.278997
H  -2.372541 1.561705 -1.925695
H  3.198411 -1.913623 -0.098664
H  2.335405 -3.13472 -1.035911
H  2.225844 -2.766638 1.99955
H  3.139453 -3.983992 1.133681
H  -2.845217 -0.409768 2.30996
H  0.987925 -4.923508 0.208102
H  0.083275 -3.748743 1.116037
H  3.389467 2.041976 -1.120058
H  -0.460007 3.52376 -0.248192
H  -5.064604 1.188626 2.130416
H  -4.197946 3.395685 0.775274
H  3.537434 4.683609 -0.419219
H  0.091256 -5.924622 2.304036
H  1.682426 -6.066368 4.092912
H  2.709008 -4.728913 3.362318
elementType: O N C H
totalener: -1165.02710559 hartree
nucrepener: 2299.32390540 hartree
electener: -3464.35101099 hartree
oneelecener: -6154.77463437 hartree
twoeener: 2690.42362338 hartree
cpcmener: -0.03616166 hartree
kineticenergy: 1160.03569196 hartree
xcener: -111.462991620403 hartree
chargesum: -0.0000000
charge: -0.278825 -0.277884 -0.433520 -0.454976 -0.105411 -0.046482 -0.375703 0.050139 -0.112896 -0.104265 0.371456 0.396615 -0.282872 0.213640 -0.024812 -0.077053 -0.280242 -0.030621 -0.128794 0.027725 -0.169236 -0.045606 -0.113048 -0.202614 -0.295200 0.111156 0.088110 0.083085 0.156169 0.138296 0.106687 0.078159 0.083810 0.111749 0.105016 0.072775 0.075827 0.169953 0.078983 0.075647 0.181229 0.184881 0.174677 0.174551 0.166752 0.130145 0.130121 0.102707
qa: -0.2788 -0.2779 -0.4335 -0.4550 -0.1054 -0.0465 -0.3757 0.0501 -0.1129 -0.1043 0.3715 0.3966 -0.2829 0.2136 -0.0248 -0.0771 -0.2802 -0.0306 -0.1288 0.0277 -0.1692 -0.0456 -0.1130 -0.2026 -0.2952 0.1112 0.0881 0.0831 0.1562 0.1383 0.1067 0.0782 0.0838 0.1117 0.1050 0.0728 0.0758 0.1700 0.0790 0.0756 0.1812 0.1849 0.1747 0.1746 0.1668 0.1301 0.1301 0.1027
va: 2.1296 2.2624 2.0813 2.0525 3.0621 3.2955 3.1165 3.9091 3.8787 3.8517 4.2107 4.2356 3.9421 3.3639 3.8824 3.8742 3.9686 3.8435 3.9393 4.0099 3.8955 3.8946 4.0328 3.8558 3.9184 1.0079 1.0190 1.0193 0.9879 1.0136 1.0058 1.0033 1.0070 0.9999 1.0196 1.0105 1.0127 1.0010 1.0098 1.0095 0.9980 1.0120 0.9916 0.9913 0.9993 1.0008 1.0047 1.0140
dispcorr: -0.026439858 hartree
energy: -1165.053545447523
dipole: -2.76545 1.78940 -0.97604 -20.11496 19.08927 -1.02569 7.09463 -5.07605 2.01858
magnitude: 2.46564 au
magnitude: 6.26715 debye
