program: Orca
programVersion: 4.2.1
elementType: O O O O N N N C C C C C C C C C C C C C C C C C C H H H H H H H H H H H H H H H H H H H H H H H
charge: 0
multiplicity: 1
keywords: wb97x-d3
keywords: def2-TZVPP
keywords: def2/J RIJCOSX GRIDX6 NOFINALGRIDX
keywords: grid4 nofinalgrid
keywords: scfconv7
keywords: smallprint printgap noloewdin
keywords: NOSOSCF
formula: C18H23N3O4
InChI: InChI=1/C18H23N3O4/c1-3-5-6-11-25-17(22)16(4-2)21(13-15-8-7-12-24-15)18(23)20-10-9-19-14-20/h3,7-10,12,14,16H,1,4-6,11,13H2,2H3
48 atoms
O  0.028433 -1.668322 0.766294
O  -2.537873 0.209858 -1.814412
O  0.16131 -0.870223 -1.31183
O  -0.398838 3.801083 -1.051225
N  -0.377439 1.684604 -0.226856
N  1.566336 2.685773 -1.109963
N  3.608867 3.447177 -1.422727
C  0.354031 0.670808 0.526123
C  0.073785 0.744006 2.02886
C  -1.831909 1.708543 -0.045966
C  0.14885 -0.702216 -0.118138
C  0.187665 2.771832 -0.795529
C  0.346871 2.127163 2.598553
C  -2.47318 0.447703 -0.486435
C  -0.189581 -3.006692 0.290472
C  -0.673899 -3.844182 1.452029
C  -3.023967 -0.588333 0.193151
C  0.297693 -3.979045 2.628173
C  2.265777 1.677461 -1.7404
C  2.429688 3.732419 -0.963679
C  -3.444876 -1.534207 -0.789099
C  -3.114287 -0.99473 -1.985098
C  3.516877 2.172562 -1.919787
C  1.574593 -4.670571 2.268162
C  1.928331 -5.873765 2.704483
H  1.422952 0.867041 0.410533
H  -0.94478 0.429629 2.263734
H  0.732069 0.025837 2.518849
H  -2.232337 2.551916 -0.605161
H  -2.083651 1.884612 1.001678
H  0.240205 2.113513 3.683427
H  1.363925 2.458649 2.37786
H  -0.339897 2.886224 2.220484
H  0.739378 -3.391904 -0.136726
H  -0.939862 -2.997558 -0.501909
H  -0.899938 -4.837253 1.055041
H  -1.621677 -3.435603 1.813383
H  -3.118263 -0.670969 1.264087
H  -0.204504 -4.533717 3.424205
H  0.518703 -2.988114 3.035681
H  1.812848 0.745083 -2.029805
H  2.13285 4.658606 -0.497556
H  -3.923843 -2.485374 -0.623386
H  -3.233982 -1.333925 -3.001595
H  4.355014 1.682721 -2.389635
H  2.247611 -4.142437 1.597917
H  2.860988 -6.335102 2.404965
H  1.300382 -6.445321 3.379299
elementType: O N C H
totalener: -1165.02496768 hartree
nucrepener: 2326.96672821 hartree
electener: -3491.99169589 hartree
oneelecener: -6209.94714120 hartree
twoeener: 2717.95544530 hartree
cpcmener: -0.03650336 hartree
kineticenergy: 1160.03282242 hartree
xcener: -111.463927715663 hartree
chargesum: -0.0000000
charge: -0.250895 -0.274458 -0.442727 -0.455887 -0.091154 -0.031225 -0.378943 0.008499 -0.089796 -0.105439 0.358221 0.374270 -0.292340 0.202809 -0.039756 -0.123274 -0.233587 -0.063245 -0.186692 0.065528 -0.220622 -0.008832 -0.109967 -0.195331 -0.285240 0.136216 0.083375 0.084246 0.132973 0.139204 0.108247 0.091878 0.081565 0.125181 0.122641 0.084301 0.079027 0.159093 0.081373 0.083300 0.211234 0.169645 0.173009 0.177666 0.167449 0.139817 0.129051 0.109589
qa: -0.2509 -0.2745 -0.4427 -0.4559 -0.0912 -0.0312 -0.3789 0.0085 -0.0898 -0.1054 0.3582 0.3743 -0.2923 0.2028 -0.0398 -0.1233 -0.2336 -0.0632 -0.1867 0.0655 -0.2206 -0.0088 -0.1100 -0.1953 -0.2852 0.1362 0.0834 0.0842 0.1330 0.1392 0.1082 0.0919 0.0816 0.1252 0.1226 0.0843 0.0790 0.1591 0.0814 0.0833 0.2112 0.1696 0.1730 0.1777 0.1674 0.1398 0.1291 0.1096
va: 2.1487 2.2841 2.0402 2.0547 3.0730 3.2580 3.1194 3.9413 3.8888 3.9121 4.1671 4.2625 3.9541 3.4833 3.8265 3.9284 3.8902 3.8658 3.9070 4.0233 3.8906 3.8730 4.0574 3.8039 3.9366 0.9869 1.0081 1.0162 1.0331 0.9938 1.0039 1.0016 1.0067 1.0012 1.0091 1.0174 1.0149 1.0028 1.0128 1.0131 0.9994 1.0013 0.9925 0.9879 1.0017 0.9933 1.0031 1.0112
dispcorr: -0.027955399 hartree
energy: -1165.052923077803
dipole: -0.08533 -1.45755 -1.54288 -21.77487 18.90190 -2.87298 21.20893 -18.86123 2.34770
magnitude: 4.01823 au
magnitude: 10.21352 debye
