program: Orca
programVersion: 4.2.1
elementType: O O O O N N N C C C C C C C C C C C C C C C C C C H H H H H H H H H H H H H H H H H H H H H H H
charge: 0
multiplicity: 1
keywords: wb97x-d3
keywords: def2-TZVPP
keywords: def2/J RIJCOSX GRIDX6 NOFINALGRIDX
keywords: grid4 nofinalgrid
keywords: scfconv7
keywords: smallprint printgap noloewdin
keywords: NOSOSCF
formula: C18H23N3O4
InChI: InChI=1/C18H23N3O4/c1-3-5-6-11-25-17(22)16(4-2)21(13-15-8-7-12-24-15)18(23)20-10-9-19-14-20/h3,7-10,12,14,16H,1,4-6,11,13H2,2H3
48 atoms
O  -0.07583 -1.009778 0.441173
O  -3.783995 0.549692 -0.135141
O  -1.821741 -0.785087 1.818712
O  0.310831 1.146192 -2.300085
N  -0.561624 1.641592 -0.254405
N  1.750062 1.390434 -0.57018
N  3.85822 0.812733 -0.318483
C  -0.543564 1.172733 1.135888
C  -1.386839 2.035769 2.065774
C  -1.877614 1.867871 -0.851569
C  -0.919332 -0.311294 1.180039
C  0.447182 1.363027 -1.117844
C  -1.009857 1.844988 3.528024
C  -2.715553 0.641331 -0.960278
C  -0.274579 -2.424979 0.309083
C  0.916959 -2.994096 -0.424216
C  -2.629806 -0.480228 -1.719312
C  2.222553 -2.911958 0.36792
C  2.278345 2.247521 0.371917
C  2.757528 0.558322 -0.957488
C  -3.716172 -1.316107 -1.325456
C  -4.376866 -0.637232 -0.359191
C  3.575454 1.871261 0.507401
C  3.365455 -3.523755 -0.376587
C  4.477031 -2.886458 -0.725741
H  0.48474 1.219494 1.497945
H  -1.22089 3.081154 1.794495
H  -2.451362 1.840338 1.932431
H  -1.730244 2.316168 -1.831973
H  -2.398475 2.616201 -0.2542
H  -1.179813 0.825166 3.871515
H  0.040062 2.087144 3.70317
H  -1.606345 2.503769 4.159316
H  -1.197701 -2.603624 -0.247232
H  -0.379457 -2.881111 1.296494
H  1.024879 -2.500511 -1.394423
H  0.687406 -4.041249 -0.640461
H  -1.880258 -0.68858 -2.46545
H  2.084674 -3.442823 1.316745
H  2.460106 -1.876253 0.620641
H  1.714774 3.053308 0.811319
H  2.611891 -0.220711 -1.689468
H  -3.968629 -2.290666 -1.711088
H  -5.253591 -0.859312 0.227862
H  4.324454 2.311797 1.146333
H  3.252699 -4.570873 -0.648221
H  5.268913 -3.389945 -1.2666
H  4.643116 -1.843266 -0.478487
elementType: O N C H
totalener: -1165.02334252 hartree
nucrepener: 2398.51401027 hartree
electener: -3563.53735278 hartree
oneelecener: -6353.70812306 hartree
twoeener: 2790.17077028 hartree
cpcmener: -0.03214405 hartree
kineticenergy: 1160.03750508 hartree
xcener: -111.460326283873 hartree
chargesum: -0.0000000
charge: -0.260385 -0.268142 -0.409179 -0.443549 -0.143011 0.003556 -0.382856 0.111642 -0.092237 -0.069856 0.279785 0.374441 -0.285401 0.211869 -0.042970 -0.129813 -0.290121 -0.062759 -0.179422 0.062528 -0.174511 -0.034942 -0.091798 -0.200053 -0.286855 0.119928 0.088462 0.078637 0.129635 0.131672 0.089145 0.082642 0.099585 0.125007 0.111847 0.075504 0.095054 0.161774 0.095610 0.078861 0.199974 0.161024 0.175712 0.173646 0.166542 0.133917 0.126775 0.103085
qa: -0.2604 -0.2681 -0.4092 -0.4435 -0.1430 0.0036 -0.3829 0.1116 -0.0922 -0.0699 0.2798 0.3744 -0.2854 0.2119 -0.0430 -0.1298 -0.2901 -0.0628 -0.1794 0.0625 -0.1745 -0.0349 -0.0918 -0.2001 -0.2869 0.1199 0.0885 0.0786 0.1296 0.1317 0.0891 0.0826 0.0996 0.1250 0.1118 0.0755 0.0951 0.1618 0.0956 0.0789 0.2000 0.1610 0.1757 0.1736 0.1665 0.1339 0.1268 0.1031
va: 2.1476 2.2835 2.0834 2.0553 3.0750 3.2679 3.0576 3.8809 3.8581 3.8906 4.2245 4.2618 3.9519 3.3794 3.8771 3.9143 3.9119 3.8346 3.8996 3.9975 3.8878 3.8870 4.0071 3.7986 3.9266 1.0028 1.0112 1.0203 1.0144 1.0025 1.0124 1.0014 1.0015 0.9960 1.0063 1.0226 1.0176 1.0150 1.0090 1.0184 0.9837 1.0016 0.9901 0.9897 0.9973 1.0017 1.0058 1.0357
dispcorr: -0.030184687 hartree
energy: -1165.053527203909
dipole: 5.12363 -6.44100 -1.31737 -8.51803 8.82590 0.30787 9.21419 -8.29166 0.92253
magnitude: 1.63747 au
magnitude: 4.16211 debye
