program: Orca
programVersion: 4.2.1
elementType: O O O O N N N C C C C C C C C C C C C C C C C C C H H H H H H H H H H H H H H H H H H H H H H H
charge: 0
multiplicity: 1
keywords: wb97x-d3
keywords: def2-TZVPP
keywords: def2/J RIJCOSX GRIDX6 NOFINALGRIDX
keywords: grid4 nofinalgrid
keywords: scfconv7
keywords: smallprint printgap noloewdin
keywords: NOSOSCF
formula: C18H23N3O4
InChI: InChI=1/C18H23N3O4/c1-3-5-6-11-25-17(22)16(4-2)21(13-15-8-7-12-24-15)18(23)20-10-9-19-14-20/h3,7-10,12,14,16H,1,4-6,11,13H2,2H3
48 atoms
O  0.054648 -1.670974 0.643766
O  -2.683573 0.326714 -1.753268
O  0.005882 -0.818417 -1.415636
O  -0.422928 3.862697 -0.991945
N  -0.405241 1.717629 -0.245117
N  1.512742 2.710936 -1.188064
N  3.557458 3.432917 -1.572005
C  0.342515 0.673085 0.445239
C  0.139431 0.711704 1.9625
C  -1.848116 1.762578 0.008537
C  0.087842 -0.679847 -0.220699
C  0.154015 2.81407 -0.801976
C  0.457036 2.077449 2.551282
C  -2.534807 0.523446 -0.425365
C  -0.134083 -3.003579 0.142397
C  -0.162981 -3.94864 1.321077
C  -3.063464 -0.522823 0.256389
C  1.153876 -4.01556 2.095701
C  2.157926 1.70561 -1.878451
C  2.407835 3.731995 -1.051017
C  -3.562768 -1.430069 -0.725638
C  -3.294582 -0.860867 -1.923394
C  3.41181 2.175796 -2.100208
C  1.079091 -4.980227 3.235581
C  1.816231 -6.07759 3.356101
H  1.408325 0.854187 0.283852
H  -0.868619 0.401649 2.244134
H  0.814217 -0.023986 2.400956
H  -2.260212 2.623652 -0.513812
H  -2.045319 1.922419 1.070132
H  1.46398 2.405087 2.284411
H  -0.240272 2.852686 2.230719
H  0.408527 2.03693 3.63956
H  0.678182 -3.256644 -0.543815
H  -1.073769 -3.050814 -0.412574
H  -0.401385 -4.9393 0.925472
H  -0.985607 -3.678344 1.989479
H  -3.094662 -0.63712 1.328102
H  1.399008 -3.02322 2.486689
H  1.964922 -4.298913 1.418879
H  1.669377 0.793659 -2.17472
H  2.156086 4.650231 -0.544503
H  -4.051808 -2.375732 -0.558604
H  -3.484603 -1.166178 -2.939856
H  4.21586 1.68063 -2.621213
H  0.349586 -4.749904 4.008085
H  1.706878 -6.743676 4.202543
H  2.553401 -6.356289 2.611356
elementType: O N C H
totalener: -1165.02694651 hartree
nucrepener: 2309.78655863 hartree
electener: -3474.81350514 hartree
oneelecener: -6175.61722962 hartree
twoeener: 2700.80372448 hartree
cpcmener: -0.03702830 hartree
kineticenergy: 1160.03263552 hartree
xcener: -111.462576707874 hartree
chargesum: 0.0000000
charge: -0.255752 -0.275289 -0.442965 -0.455731 -0.091774 -0.030238 -0.378768 0.014448 -0.093143 -0.101749 0.359116 0.373700 -0.289692 0.201202 -0.032230 -0.111580 -0.237977 -0.030338 -0.186032 0.065618 -0.217840 -0.011809 -0.108695 -0.215347 -0.282925 0.136025 0.083042 0.084182 0.132246 0.139663 0.091631 0.080943 0.108840 0.115011 0.121284 0.080684 0.078046 0.160413 0.084874 0.066998 0.209121 0.169653 0.174915 0.177397 0.167545 0.134892 0.128030 0.110353
qa: -0.2558 -0.2753 -0.4430 -0.4557 -0.0918 -0.0302 -0.3788 0.0144 -0.0931 -0.1017 0.3591 0.3737 -0.2897 0.2012 -0.0322 -0.1116 -0.2380 -0.0303 -0.1860 0.0656 -0.2178 -0.0118 -0.1087 -0.2153 -0.2829 0.1360 0.0830 0.0842 0.1322 0.1397 0.0916 0.0809 0.1088 0.1150 0.1213 0.0807 0.0780 0.1604 0.0849 0.0670 0.2091 0.1697 0.1749 0.1774 0.1675 0.1349 0.1280 0.1104
va: 2.1545 2.2836 2.0410 2.0547 3.0728 3.2586 3.1193 3.9428 3.8958 3.9090 4.1553 4.2631 3.9506 3.4839 3.8591 3.9208 3.8918 3.8212 3.9093 4.0236 3.8953 3.8723 4.0573 3.8202 3.9453 0.9872 1.0085 1.0158 1.0330 0.9939 1.0017 1.0073 1.0041 1.0030 1.0043 1.0183 1.0178 1.0028 1.0141 1.0168 1.0004 1.0013 0.9914 0.9879 1.0016 1.0005 1.0033 1.0118
dispcorr: -0.027170348 hartree
energy: -1165.054116854355
dipole: 1.98521 -3.30306 -1.31786 -22.57321 19.69264 -2.88057 21.35626 -19.12219 2.23408
magnitude: 3.87628 au
magnitude: 9.85272 debye
