program: Orca
programVersion: 4.2.1
elementType: O O O O N N N C C C C C C C C C C C C C C C C C C H H H H H H H H H H H H H H H H H H H H H H H
charge: 0
multiplicity: 1
keywords: wb97x-d3
keywords: def2-TZVPP
keywords: def2/J RIJCOSX GRIDX6 NOFINALGRIDX
keywords: grid4 nofinalgrid
keywords: scfconv7
keywords: smallprint printgap noloewdin
keywords: NOSOSCF
formula: C18H23N3O4
InChI: InChI=1/C18H23N3O4/c1-3-5-6-11-25-17(22)16(4-2)21(13-15-8-7-12-24-15)18(23)20-10-9-19-14-20/h3,7-10,12,14,16H,1,4-6,11,13H2,2H3
48 atoms
O  0.102858 -0.912455 0.935331
O  -1.724526 -0.566475 -1.706081
O  -1.084242 -0.419772 2.76044
O  0.096843 2.695593 -1.92678
N  -0.474295 1.616839 -0.009991
N  1.766324 2.170041 -0.491694
N  3.79358 1.444645 -0.031348
C  -0.211957 1.376132 1.404937
C  -0.955265 2.347121 2.322112
C  -1.867836 1.499342 -0.441469
C  -0.474549 -0.080612 1.779381
C  0.39811 2.181405 -0.872949
C  -0.695601 3.799279 1.957261
C  -2.28994 0.096518 -0.674024
C  -0.054087 -2.322365 1.158893
C  0.660074 -3.049651 0.042134
C  -3.19109 -0.701041 -0.051238
C  0.384084 -4.543352 0.114095
C  2.612543 3.242291 -0.662757
C  2.543212 1.108683 -0.123485
C  -3.174631 -1.946464 -0.750885
C  -2.264646 -1.802836 -1.740862
C  3.849094 2.776308 -0.351844
C  1.026233 -5.365109 -0.958074
C  1.789242 -4.921417 -1.950291
H  0.852096 1.534474 1.589846
H  -2.027865 2.14579 2.337445
H  -0.602741 2.162158 3.337603
H  -2.006089 2.095539 -1.341466
H  -2.522269 1.934417 0.313725
H  0.372503 4.026212 1.936769
H  -1.113877 4.069797 0.98652
H  -1.151957 4.459637 2.694804
H  -1.11861 -2.567956 1.16854
H  0.365415 -2.588598 2.132311
H  1.735412 -2.862145 0.107734
H  0.323202 -2.658277 -0.9210
H  -3.794207 -0.437315 0.802995
H  -0.697336 -4.719423 0.076834
H  0.699274 -4.938284 1.08655
H  2.261125 4.215464 -0.960579
H  2.13641 0.12258 0.0330
H  -3.759357 -2.827074 -0.539459
H  -1.91779 -2.461709 -2.520827
H  4.77642 3.326905 -0.340653
H  0.826739 -6.431089 -0.896011
H  2.200857 -5.604443 -2.682546
H  2.033243 -3.874573 -2.084893
elementType: O N C H
totalener: -1165.02547500 hartree
nucrepener: 2354.23528719 hartree
electener: -3519.26076219 hartree
oneelecener: -6264.42402815 hartree
twoeener: 2745.16326595 hartree
cpcmener: -0.03579936 hartree
kineticenergy: 1160.03175603 hartree
xcener: -111.463639480168 hartree
chargesum: 0.0000000
charge: -0.256505 -0.277073 -0.420427 -0.448539 -0.099910 -0.029935 -0.375384 -0.015567 -0.107446 -0.086776 0.364980 0.366122 -0.283187 0.228480 -0.048295 -0.113178 -0.281139 -0.039424 -0.135545 0.032208 -0.176807 -0.043354 -0.109980 -0.198258 -0.296469 0.140023 0.078578 0.089912 0.136411 0.149030 0.089926 0.083186 0.107892 0.112813 0.134282 0.098591 0.074039 0.160418 0.077887 0.083907 0.184512 0.178232 0.168155 0.174413 0.165600 0.129926 0.130836 0.102839
qa: -0.2565 -0.2771 -0.4204 -0.4485 -0.0999 -0.0299 -0.3754 -0.0156 -0.1074 -0.0868 0.3650 0.3661 -0.2832 0.2285 -0.0483 -0.1132 -0.2811 -0.0394 -0.1355 0.0322 -0.1768 -0.0434 -0.1100 -0.1983 -0.2965 0.1400 0.0786 0.0899 0.1364 0.1490 0.0899 0.0832 0.1079 0.1128 0.1343 0.0986 0.0740 0.1604 0.0779 0.0839 0.1845 0.1782 0.1682 0.1744 0.1656 0.1299 0.1308 0.1028
va: 2.1354 2.2618 2.0791 2.0616 3.0715 3.2654 3.1115 3.9549 3.8965 3.8808 4.2362 4.2650 3.9575 3.4238 3.8377 3.8954 3.9388 3.8646 3.9224 4.0150 3.8510 3.8522 4.0212 3.8490 3.9219 0.9864 1.0074 1.0162 1.0285 0.9915 1.0009 1.0048 1.0058 0.9971 1.0054 1.0066 1.0054 1.0066 1.0062 1.0056 0.9958 1.0115 0.9957 0.9920 0.9994 1.0009 1.0046 1.0141
dispcorr: -0.028651307 hartree
energy: -1165.054126307554
dipole: -2.27917 0.72333 -1.55584 -10.99741 10.44306 -0.55435 5.77914 -4.80249 0.97665
magnitude: 1.91879 au
magnitude: 4.87719 debye
