program: Orca
programVersion: 4.2.1
elementType: O O O O N N N C C C C C C C C C C C C C C C C C C H H H H H H H H H H H H H H H H H H H H H H H
charge: 0
multiplicity: 1
keywords: wb97x-d3
keywords: def2-TZVPP
keywords: def2/J RIJCOSX GRIDX6 NOFINALGRIDX
keywords: grid4 nofinalgrid
keywords: scfconv7
keywords: smallprint printgap noloewdin
keywords: NOSOSCF
formula: C18H23N3O4
InChI: InChI=1/C18H23N3O4/c1-3-5-6-11-25-17(22)16(4-2)21(13-15-8-7-12-24-15)18(23)20-10-9-19-14-20/h3,7-10,12,14,16H,1,4-6,11,13H2,2H3
48 atoms
O  0.367946 -2.054166 -0.371089
O  -3.682263 1.455078 0.20325
O  -0.227474 -2.660779 1.706285
O  -0.120174 0.885216 -2.256136
N  -0.737955 0.331685 -0.141365
N  1.353177 1.330416 -0.593889
N  2.846282 2.454549 0.57895
C  -0.303138 -0.329727 1.082717
C  -1.219673 -0.059756 2.273512
C  -2.034514 -0.08709 -0.686125
C  -0.072689 -1.824573 0.861685
C  0.119056 0.829417 -1.07754
C  -1.251772 1.401227 2.691901
C  -2.975677 1.044225 -0.87356
C  0.777327 -3.375366 -0.733227
C  2.286754 -3.481127 -0.822249
C  -3.285328 1.810499 -1.946046
C  3.041914 -3.222725 0.484257
C  2.540126 1.240711 -1.282007
C  1.603921 2.092421 0.513544
C  -4.250244 2.759079 -1.495434
C  -4.447509 2.492041 -0.184866
C  3.444801 1.921866 -0.530902
C  3.185291 -1.77569 0.841247
C  2.969864 -1.247472 2.040003
H  0.69176 0.038719 1.344346
H  -2.233793 -0.406305 2.064426
H  -0.867037 -0.669508 3.104853
H  -2.470497 -0.81757 -0.003945
H  -1.891502 -0.594588 -1.639683
H  -1.956972 1.544656 3.509634
H  -0.275989 1.734682 3.049295
H  -1.562589 2.056028 1.878747
H  0.330533 -3.568901 -1.709376
H  0.378427 -4.10307 -0.025596
H  2.659713 -2.812702 -1.603821
H  2.502729 -4.495961 -1.167596
H  -2.862434 1.715969 -2.931825
H  4.050463 -3.632618 0.365342
H  2.58465 -3.777268 1.307891
H  2.61973 0.711078 -2.214799
H  0.825976 2.377205 1.203727
H  -4.729159 3.533527 -2.070489
H  -5.079396 2.933691 0.567628
H  4.49496 2.064537 -0.728461
H  3.539669 -1.123135 0.047495
H  3.152016 -0.196664 2.226095
H  2.613979 -1.842395 2.872705
totalener: -1164.99759172 hartree
nucrepener: 2387.77790680 hartree
electener: -3552.77549853 hartree
oneelecener: -6331.97105467 hartree
twoeener: 2779.19555614 hartree
kineticenergy: 1160.08802901 hartree
xcener: -111.466792355301 hartree
chargesum: 0.0000000
charge: -0.253986 -0.264049 -0.333693 -0.369238 -0.103920 0.017131 -0.292958 0.039705 -0.057085 -0.082590 0.270375 0.339358 -0.300412 0.167362 -0.048695 -0.115648 -0.232626 -0.067296 -0.153982 -0.028667 -0.140915 -0.031402 -0.066324 -0.137518 -0.266130 0.060197 0.076233 0.094209 0.122598 0.132650 0.101955 0.084917 0.084989 0.102441 0.107677 0.071131 0.079963 0.149399 0.092740 0.080056 0.154424 0.172932 0.138891 0.142358 0.130912 0.108433 0.119518 0.104580
qa: -0.2540 -0.2640 -0.3337 -0.3692 -0.1039 0.0171 -0.2930 0.0397 -0.0571 -0.0826 0.2704 0.3394 -0.3004 0.1674 -0.0487 -0.1156 -0.2326 -0.0673 -0.1540 -0.0287 -0.1409 -0.0314 -0.0663 -0.1375 -0.2661 0.0602 0.0762 0.0942 0.1226 0.1327 0.1020 0.0849 0.0850 0.1024 0.1077 0.0711 0.0800 0.1494 0.0927 0.0801 0.1544 0.1729 0.1389 0.1424 0.1309 0.1084 0.1195 0.1046
va: 2.1257 2.2867 2.1659 2.1353 3.0146 3.2448 3.1009 3.9424 3.8072 3.8931 4.2521 4.2732 3.9483 3.5124 3.8998 3.8787 4.0301 3.8542 3.9082 4.0305 3.9489 3.9253 3.9910 3.7727 3.9381 1.0367 1.0215 1.0258 1.0077 1.0210 1.0089 0.9981 1.0087 0.9983 1.0178 1.0138 1.0152 1.0153 1.0020 1.0211 1.0124 1.0008 1.0045 1.0023 1.0075 1.0181 1.0148 1.0154
dispcorr: -0.030708298 hartree
energy: -1165.028300022498
dipole: 6.20220 -6.73557 -0.53337 -9.55124 8.62319 -0.92804 8.24009 -8.53787 -0.29778
magnitude: 1.11104 au
magnitude: 2.82405 debye
