program: Orca
programVersion: 4.2.1
elementType: O O O O N N N C C C C C C C C C C C C C C C C C C H H H H H H H H H H H H H H H H H H H H H H H
charge: 0
multiplicity: 1
keywords: wb97x-d3
keywords: def2-TZVPP
keywords: def2/J RIJCOSX GRIDX6 NOFINALGRIDX
keywords: grid4 nofinalgrid
keywords: scfconv7
keywords: smallprint printgap noloewdin
keywords: NOSOSCF
formula: C18H23N3O4
InChI: InChI=1/C18H23N3O4/c1-3-5-6-11-25-17(22)16(4-2)21(13-15-8-7-12-24-15)18(23)20-10-9-19-14-20/h3,7-10,12,14,16H,1,4-6,11,13H2,2H3
48 atoms
O  -0.216394 -1.141508 -0.327983
O  -2.63511 0.214703 -1.843708
O  -1.002895 -1.589052 1.728227
O  0.026959 1.80219 -2.139897
N  -0.47344 1.512885 0.065083
N  1.742958 1.388578 -0.720138
N  3.817063 0.729326 -1.071309
C  -0.221579 0.633917 1.203165
C  -0.860301 1.125637 2.49695
C  -1.869243 1.851169 -0.207758
C  -0.56426 -0.827288 0.91349
C  0.366357 1.571855 -1.010763
C  -0.4062 2.524137 2.884778
C  -2.724231 0.69581 -0.588508
C  -0.313447 -2.498097 -0.765573
C  1.051836 -3.152114 -0.848078
C  -3.608922 -0.0452 0.1249
C  1.789529 -3.308448 0.48465
C  2.500518 1.922127 0.298815
C  2.600591 0.695191 -1.520278
C  -4.089774 -1.05612 -0.756474
C  -3.459336 -0.841319 -1.934299
C  3.770936 1.501995 0.056576
C  2.447857 -2.059844 0.983661
C  2.343873 -1.579604 2.217021
H  0.856674 0.606476 1.38052
H  -1.949805 1.075727 2.443619
H  -0.581876 0.421325 3.280592
H  -1.887488 2.615437 -0.983192
H  -2.291747 2.304996 0.688597
H  -0.86486 2.830188 3.824352
H  0.675246 2.561846 3.02732
H  -0.664785 3.272218 2.134496
H  -0.77107 -2.457067 -1.754294
H  -0.977576 -3.060009 -0.107828
H  1.682126 -2.609282 -1.558883
H  0.891277 -4.141609 -1.28546
H  -3.880235 0.100538 1.157648
H  2.576178 -4.055863 0.337069
H  1.118856 -3.716499 1.245336
H  2.08522 2.572291 1.049339
H  2.259797 0.180556 -2.404556
H  -4.806316 -1.830319 -0.539882
H  -3.50886 -1.332798 -2.891861
H  4.658967 1.723777 0.626536
H  3.0932 -1.546502 0.275601
H  2.890731 -0.696105 2.519472
H  1.71439 -2.048557 2.963469
totalener: -1164.99546792 hartree
nucrepener: 2465.80553969 hartree
electener: -3630.80100761 hartree
oneelecener: -6488.19062886 hartree
twoeener: 2857.38962124 hartree
kineticenergy: 1160.09546066 hartree
xcener: -111.472093066066 hartree
chargesum: -0.0000000
charge: -0.244797 -0.229414 -0.329685 -0.341071 -0.130725 0.021668 -0.309373 0.100213 -0.075302 -0.106898 0.215527 0.320278 -0.278103 0.202905 -0.045351 -0.126527 -0.224030 -0.064263 -0.167493 0.030053 -0.132717 -0.064348 -0.083573 -0.143115 -0.259121 0.057540 0.071301 0.093062 0.124694 0.126194 0.103912 0.074595 0.084528 0.099929 0.110268 0.074763 0.083083 0.133000 0.091526 0.077415 0.176350 0.138920 0.138040 0.144995 0.129670 0.126399 0.104007 0.101068
qa: -0.2448 -0.2294 -0.3297 -0.3411 -0.1307 0.0217 -0.3094 0.1002 -0.0753 -0.1069 0.2155 0.3203 -0.2781 0.2029 -0.0454 -0.1265 -0.2240 -0.0643 -0.1675 0.0301 -0.1327 -0.0643 -0.0836 -0.1431 -0.2591 0.0575 0.0713 0.0931 0.1247 0.1262 0.1039 0.0746 0.0845 0.0999 0.1103 0.0748 0.0831 0.1330 0.0915 0.0774 0.1764 0.1389 0.1380 0.1450 0.1297 0.1264 0.1040 0.1011
va: 2.1190 2.3214 2.1645 2.1606 2.9931 3.2443 3.0749 3.8645 3.8625 3.9525 4.3404 4.2963 3.9426 3.4457 3.8760 3.9135 4.0014 3.8641 3.8708 4.0402 3.9309 3.9190 4.0243 3.7678 3.9468 1.0386 1.0126 1.0239 1.0261 0.9877 1.0079 1.0030 1.0060 0.9978 1.0158 1.0132 1.0149 1.0124 1.0028 1.0202 0.9951 1.0110 1.0048 1.0012 1.0092 1.0231 1.0127 1.0172
dispcorr: -0.033383374 hartree
energy: -1165.028851297753
dipole: 2.31002 -3.38636 -1.07633 -6.64533 6.41351 -0.23182 14.52236 -13.66293 0.85943
magnitude: 1.39673 au
magnitude: 3.55019 debye
