program: Orca
programVersion: 4.2.1
elementType: O O O O N N N C C C C C C C C C C C C C C C C C C H H H H H H H H H H H H H H H H H H H H H H H
charge: 0
multiplicity: 1
keywords: wb97x-d3
keywords: def2-TZVPP
keywords: def2/J RIJCOSX GRIDX6 NOFINALGRIDX
keywords: grid4 nofinalgrid
keywords: scfconv7
keywords: smallprint printgap noloewdin
keywords: NOSOSCF
formula: C18H23N3O4
InChI: InChI=1/C18H23N3O4/c1-3-5-6-11-25-17(22)16(4-2)21(13-15-8-7-12-24-15)18(23)20-10-9-19-14-20/h3,7-10,12,14,16H,1,4-6,11,13H2,2H3
48 atoms
O  0.615439 -0.582578 0.667118
O  -3.250181 0.029566 0.273145
O  -0.925774 -0.406716 2.280532
O  0.4274 0.927545 -2.327856
N  -0.402002 1.757195 -0.368557
N  1.883103 1.880837 -0.875516
N  4.084421 1.850623 -0.761868
C  -0.19373 1.575176 1.071837
C  -1.139836 2.420656 1.916599
C  -1.764692 1.573107 -0.866966
C  -0.243734 0.084856 1.42722
C  0.592212 1.457059 -1.25863
C  -0.650213 2.591424 3.348826
C  -2.319554 0.200907 -0.691925
C  0.612896 -2.010806 0.735486
C  1.511543 -2.51753 -0.372557
C  -2.065335 -0.986374 -1.297045
C  1.495908 -4.045005 -0.462521
C  2.257417 3.03718 -0.223189
C  3.036125 1.218592 -1.184229
C  -2.8888 -1.950701 -0.647414
C  -3.580255 -1.271367 0.296859
C  3.61399 2.992229 -0.170883
C  0.172727 -4.586406 -0.90406
C  -0.587911 -5.418246 -0.205174
H  0.823763 1.89977 1.30218
H  -1.21371 3.404206 1.444738
H  -2.142802 1.992362 1.924789
H  -1.768235 1.842341 -1.921233
H  -2.409289 2.291457 -0.3601
H  0.34345 3.042107 3.380242
H  -1.322184 3.245627 3.903088
H  -0.609591 1.641687 3.877709
H  -0.407538 -2.380541 0.618459
H  0.975866 -2.335867 1.71468
H  2.535044 -2.173374 -0.203757
H  1.188317 -2.088999 -1.326194
H  -1.369723 -1.145482 -2.103958
H  1.778223 -4.484248 0.498463
H  2.263541 -4.353845 -1.177779
H  1.545547 3.781855 0.0889
H  3.025282 0.273693 -1.703745
H  -2.946985 -3.006824 -0.85106
H  -4.310652 -1.571222 1.029211
H  4.281819 3.725558 0.251945
H  -0.171957 -4.25195 -1.879629
H  -1.534964 -5.777584 -0.584449
H  -0.29065 -5.777973 0.772448
totalener: -1164.99680081 hartree
nucrepener: 2394.55523206 hartree
electener: -3559.55203287 hartree
oneelecener: -6345.48587931 hartree
twoeener: 2785.93384644 hartree
kineticenergy: 1160.08390402 hartree
xcener: -111.463282628932 hartree
chargesum: 0.0000000
charge: -0.267171 -0.248884 -0.329637 -0.364434 -0.144226 -0.002416 -0.303155 0.082414 -0.100864 -0.103549 0.239869 0.316651 -0.278588 0.201030 -0.015301 -0.129418 -0.268024 -0.076814 -0.184134 0.065319 -0.134306 0.001017 -0.067768 -0.174915 -0.207196 0.108698 0.079702 0.084233 0.129934 0.126103 0.073045 0.091062 0.104110 0.105338 0.112211 0.089587 0.076406 0.148996 0.068066 0.091059 0.169498 0.137666 0.135947 0.136183 0.130996 0.107590 0.103030 0.085035
qa: -0.2672 -0.2489 -0.3296 -0.3644 -0.1442 -0.0024 -0.3032 0.0824 -0.1009 -0.1035 0.2399 0.3167 -0.2786 0.2010 -0.0153 -0.1294 -0.2680 -0.0768 -0.1841 0.0653 -0.1343 0.0010 -0.0678 -0.1749 -0.2072 0.1087 0.0797 0.0842 0.1299 0.1261 0.0730 0.0911 0.1041 0.1053 0.1122 0.0896 0.0764 0.1490 0.0681 0.0911 0.1695 0.1377 0.1359 0.1362 0.1310 0.1076 0.1030 0.0850
va: 2.1384 2.3105 2.1590 2.1273 3.0249 3.2595 3.1318 3.9017 3.8661 3.9270 4.2684 4.2913 3.9565 3.4085 3.8486 3.8700 3.9615 3.9118 3.9027 4.0570 3.8968 3.9306 4.0597 3.8289 3.9508 1.0053 1.0090 1.0178 1.0102 1.0005 1.0027 1.0040 1.0125 0.9994 1.0097 1.0129 1.0161 1.0189 1.0152 1.0074 0.9966 1.0089 1.0085 1.0032 1.0082 1.0085 1.0093 1.0165
dispcorr: -0.030192705 hartree
energy: -1165.026993518376
dipole: -1.66826 0.75559 -0.91267 -11.19553 11.16532 -0.03022 8.09023 -7.56281 0.52742
magnitude: 1.05454 au
magnitude: 2.68042 debye
