program: Orca
programVersion: 4.2.1
elementType: O O O O N N N C C C C C C C C C C C C C C C C C C H H H H H H H H H H H H H H H H H H H H H H H
charge: 0
multiplicity: 1
keywords: wb97x-d3
keywords: def2-TZVPP
keywords: def2/J RIJCOSX GRIDX6 NOFINALGRIDX
keywords: grid4 nofinalgrid
keywords: scfconv7
keywords: smallprint printgap noloewdin
keywords: NOSOSCF
formula: C18H23N3O4
InChI: InChI=1/C18H23N3O4/c1-3-5-6-11-25-17(22)16(4-2)21(13-15-8-7-12-24-15)18(23)20-10-9-19-14-20/h3,7-10,12,14,16H,1,4-6,11,13H2,2H3
48 atoms
O  0.265459 -2.252158 1.276251
O  -4.258253 0.850205 -0.153615
O  -0.378784 -2.132525 -0.866493
O  -0.426089 2.359506 -1.957366
N  -0.8824 0.561967 -0.649888
N  1.295248 1.422807 -0.796781
N  3.337707 0.621465 -0.579723
C  -0.571687 -0.18532 0.555561
C  -1.648672 -0.069394 1.643691
C  -2.176338 0.376004 -1.30809
C  -0.23814 -1.634637 0.216926
C  -0.070652 1.50719 -1.184126
C  -1.811746 1.35427 2.153863
C  -3.251513 1.334209 -0.917977
C  0.852354 -3.548417 1.093759
C  2.267112 -3.447963 0.553387
C  -3.47063 2.646579 -1.179744
C  3.22458 -2.668441 1.457939
C  2.091433 2.479707 -0.42536
C  2.112828 0.332011 -0.890316
C  -4.687487 2.989894 -0.521561
C  -5.11667 1.858463 0.081573
C  3.336801 1.955231 -0.273886
C  4.571811 -2.505208 0.827459
C  5.659125 -3.173323 1.188236
H  0.335296 0.240338 0.990236
H  -2.602177 -0.46394 1.290187
H  -1.345042 -0.712343 2.470794
H  -2.506388 -0.64402 -1.116725
H  -2.009458 0.440444 -2.382947
H  -2.108616 2.05004 1.370269
H  -2.574652 1.393704 2.930227
H  -0.8813 1.721853 2.590315
H  0.226268 -4.158791 0.441177
H  0.848701 -3.99504 2.088389
H  2.251563 -3.017247 -0.451155
H  2.643624 -4.466956 0.428356
H  -2.836508 3.28745 -1.767141
H  3.316207 -3.184031 2.418407
H  2.813715 -1.677386 1.668128
H  1.700154 3.47408 -0.300243
H  1.758147 -0.623695 -1.243268
H  -5.175984 3.949721 -0.507632
H  -5.983374 1.627007 0.67801
H  4.235824 2.463818 0.033865
H  4.627951 -1.782824 0.018307
H  6.60671 -3.02651 0.68816
H  5.64697 -3.890563 2.000728
totalener: -1164.99986244 hartree
nucrepener: 2313.56819101 hartree
electener: -3478.56805345 hartree
oneelecener: -6183.43818759 hartree
twoeener: 2704.87013414 hartree
kineticenergy: 1160.06819850 hartree
xcener: -111.459709299650 hartree
chargesum: -0.0000000
charge: -0.267479 -0.260121 -0.344626 -0.371557 -0.097060 -0.042103 -0.323464 0.025004 -0.132804 -0.072965 0.249445 0.337129 -0.268591 0.133573 0.002794 -0.149003 -0.210388 -0.086271 -0.119839 0.027845 -0.136051 -0.028542 -0.068001 -0.148426 -0.231799 0.119200 0.087950 0.102703 0.123711 0.127089 0.092492 0.097593 0.085385 0.111430 0.103880 0.091627 0.089387 0.157248 0.068278 0.093330 0.155582 0.165592 0.139789 0.140241 0.131045 0.121798 0.102210 0.075735
qa: -0.2675 -0.2601 -0.3446 -0.3716 -0.0971 -0.0421 -0.3235 0.0250 -0.1328 -0.0730 0.2494 0.3371 -0.2686 0.1336 0.0028 -0.1490 -0.2104 -0.0863 -0.1198 0.0278 -0.1361 -0.0285 -0.0680 -0.1484 -0.2318 0.1192 0.0880 0.1027 0.1237 0.1271 0.0925 0.0976 0.0854 0.1114 0.1039 0.0916 0.0894 0.1572 0.0683 0.0933 0.1556 0.1656 0.1398 0.1402 0.1310 0.1218 0.1022 0.0757
va: 2.1221 2.2826 2.1289 2.1305 3.0736 3.3070 3.0754 3.9415 3.8088 3.9084 4.2485 4.2572 3.9265 3.4803 3.8511 3.8341 3.9930 3.8442 3.9182 3.9696 3.9467 3.9058 4.0121 3.8256 3.9873 1.0063 1.0220 1.0241 1.0166 1.0066 1.0122 1.0068 1.0065 1.0133 0.9950 1.0244 1.0227 1.0201 1.0200 1.0189 1.0080 1.0048 1.0041 1.0032 1.0052 1.0277 1.0091 1.0168
dispcorr: -0.028166055 hartree
energy: -1165.028028492657
dipole: 8.52478 -9.53654 -1.01176 -10.43291 10.13987 -0.29304 13.68090 -12.31172 1.36918
magnitude: 1.72748 au
magnitude: 4.39091 debye
