program: Orca
programVersion: 4.2.1
elementType: O O O O N N N C C C C C C C C C C C C C C C C C C H H H H H H H H H H H H H H H H H H H H H H H
charge: 0
multiplicity: 1
keywords: wb97x-d3
keywords: def2-TZVPP
keywords: def2/J RIJCOSX GRIDX6 NOFINALGRIDX
keywords: grid4 nofinalgrid
keywords: scfconv7
keywords: smallprint printgap noloewdin
keywords: NOSOSCF
formula: C18H23N3O4
InChI: InChI=1/C18H23N3O4/c1-3-5-6-11-25-17(22)16(4-2)21(13-15-8-7-12-24-15)18(23)20-10-9-19-14-20/h3,7-10,12,14,16H,1,4-6,11,13H2,2H3
48 atoms
O  -0.06418 -1.361613 0.104975
O  -3.597768 0.341881 0.065292
O  -1.500321 -1.148012 1.80958
O  0.356202 3.083887 -1.633388
N  -0.419934 1.376034 -0.34882
N  1.884034 1.872786 -0.481729
N  4.007004 2.288531 -0.048662
C  -0.345676 0.808812 0.994212
C  -1.110303 1.624299 2.037277
C  -1.756485 1.601062 -0.907298
C  -0.739348 -0.668535 1.01698
C  0.557666 2.174193 -0.868389
C  -0.643296 3.07171 2.09288
C  -2.622196 0.393165 -0.867234
C  -0.305703 -2.769217 0.013966
C  0.483714 -3.559724 1.04043
C  -2.658662 -0.731913 -1.624225
C  2.001196 -3.385982 0.939333
C  2.496817 0.647917 -0.314129
C  2.859773 2.819396 -0.326806
C  -3.717311 -1.531318 -1.107378
C  -4.244468 -0.82382 -0.080414
C  3.797527 0.935662 -0.048952
C  2.55304 -3.873952 -0.36219
C  3.230246 -3.142823 -1.237493
H  0.704562 0.825803 1.297342
H  -2.186025 1.57409 1.869594
H  -0.945164 1.151358 3.00644
H  -1.627638 1.908972 -1.942771
H  -2.258713 2.432036 -0.402317
H  -0.874569 3.62454 1.181189
H  -1.130032 3.596126 2.914429
H  0.43379 3.142489 2.257151
H  0.003511 -3.034715 -0.997371
H  -1.374352 -2.968863 0.110087
H  0.229284 -4.614744 0.895139
H  0.143555 -3.305959 2.04582
H  -2.001487 -0.963376 -2.44639
H  2.46125 -3.950989 1.755787
H  2.281066 -2.341881 1.101007
H  1.969604 -0.281022 -0.438095
H  2.649475 3.872878 -0.421795
H  -4.044379 -2.496422 -1.456757
H  -5.052131 -1.017717 0.605058
H  4.601338 0.240286 0.134891
H  2.366729 -4.920777 -0.590789
H  3.604141 -3.564063 -2.160603
H  3.449656 -2.095917 -1.064536
totalener: -1164.99658633 hartree
nucrepener: 2383.39850966 hartree
electener: -3548.39509599 hartree
oneelecener: -6322.79363878 hartree
twoeener: 2774.39854279 hartree
kineticenergy: 1160.07075780 hartree
xcener: -111.465014410601 hartree
chargesum: -0.0000000
charge: -0.270996 -0.249924 -0.332587 -0.362352 -0.109653 -0.033394 -0.298311 -0.041796 -0.097557 -0.128098 0.324890 0.305458 -0.260750 0.241279 -0.028372 -0.145025 -0.276388 -0.080331 -0.161160 0.055051 -0.150800 0.007475 -0.057039 -0.166361 -0.208418 0.115643 0.082522 0.085225 0.127846 0.127843 0.077732 0.102541 0.083013 0.116373 0.120206 0.080811 0.100287 0.138775 0.092172 0.064454 0.159388 0.146178 0.144931 0.138413 0.124208 0.110832 0.105261 0.080505
qa: -0.2710 -0.2499 -0.3326 -0.3624 -0.1097 -0.0334 -0.2983 -0.0418 -0.0976 -0.1281 0.3249 0.3055 -0.2607 0.2413 -0.0284 -0.1450 -0.2764 -0.0803 -0.1612 0.0551 -0.1508 0.0075 -0.0570 -0.1664 -0.2084 0.1156 0.0825 0.0852 0.1278 0.1278 0.0777 0.1025 0.0830 0.1164 0.1202 0.0808 0.1003 0.1388 0.0922 0.0645 0.1594 0.1462 0.1449 0.1384 0.1242 0.1108 0.1053 0.0805
va: 2.0897 2.3164 2.1627 2.1368 3.0108 3.2958 3.1455 3.9578 3.8950 3.8826 4.2502 4.2886 3.9331 3.4287 3.8219 3.8801 3.9421 3.8786 3.8831 4.0379 3.9171 3.9245 4.0477 3.8177 3.9537 0.9967 1.0248 1.0196 1.0149 1.0071 1.0116 1.0073 1.0038 0.9982 1.0122 1.0132 1.0256 1.0128 1.0121 1.0186 1.0231 1.0079 1.0017 1.0025 1.0137 1.0056 1.0116 1.0158
dispcorr: -0.030186582 hartree
energy: -1165.026772916133
dipole: 3.07633 -4.27068 -1.19435 -12.44902 10.91618 -1.53284 6.47657 -6.20863 0.26793
magnitude: 1.96159 au
magnitude: 4.98598 debye
