program: Orca
programVersion: 4.2.1
elementType: O O O O N N N C C C C C C C C C C C C C C C C C C H H H H H H H H H H H H H H H H H H H H H H H
charge: 0
multiplicity: 1
keywords: wb97x-d3
keywords: def2-TZVPP
keywords: def2/J RIJCOSX GRIDX6 NOFINALGRIDX
keywords: grid4 nofinalgrid
keywords: scfconv7
keywords: smallprint printgap noloewdin
keywords: NOSOSCF
formula: C18H23N3O4
InChI: InChI=1/C18H23N3O4/c1-3-5-6-11-25-17(22)16(4-2)21(13-15-8-7-12-24-15)18(23)20-10-9-19-14-20/h3,7-10,12,14,16H,1,4-6,11,13H2,2H3
48 atoms
O  -0.286093 -1.194624 0.122282
O  -2.311248 0.010186 -2.009104
O  -1.233438 -1.072974 2.147226
O  -0.081932 3.319213 -1.423421
N  -0.601764 1.569922 -0.058211
N  1.625214 2.044807 -0.652472
N  3.507805 0.900371 -0.769556
C  -0.253402 0.911426 1.194723
C  -0.767421 1.65732 2.428473
C  -2.026211 1.734335 -0.333236
C  -0.675254 -0.558541 1.218814
C  0.253756 2.378828 -0.75062
C  -0.339494 3.116533 2.446758
C  -2.669103 0.480321 -0.798356
C  -0.555865 -2.598825 0.023532
C  0.44143 -3.445154 0.791318
C  -3.598412 -0.334159 -0.241902
C  1.895367 -3.243081 0.362455
C  2.64644 2.968068 -0.647287
C  2.216415 0.811448 -0.746443
C  -3.823332 -1.383038 -1.182208
C  -3.010327 -1.116447 -2.230231
C  3.790284 2.238341 -0.69702
C  2.821821 -4.137803 1.122025
C  3.580634 -5.083069 0.58528
H  0.836528 0.900436 1.27174
H  -1.852078 1.574183 2.517446
H  -0.369397 1.147334 3.306615
H  -2.136823 2.520208 -1.078794
H  -2.550312 2.080647 0.559795
H  0.743724 3.218992 2.355912
H  -0.793805 3.696374 1.642655
H  -0.631042 3.586238 3.385474
H  -0.497712 -2.810234 -1.044491
H  -1.576096 -2.802043 0.351928
H  0.163221 -4.490399 0.627088
H  0.331879 -3.270771 1.863986
H  -4.059311 -0.210882 0.724261
H  2.193487 -2.202745 0.528219
H  1.998465 -3.42737 -0.710814
H  2.459251 4.026509 -0.606795
H  1.639347 -0.095544 -0.8281
H  -4.499462 -2.216114 -1.087953
H  -2.838553 -1.614509 -3.170112
H  4.805685 2.599965 -0.688643
H  2.848315 -3.989804 2.198368
H  4.228176 -5.703108 1.189884
H  3.591622 -5.267211 -0.482148
totalener: -1164.99737015 hartree
nucrepener: 2353.46348183 hartree
electener: -3518.46085198 hartree
oneelecener: -6263.00999267 hartree
twoeener: 2744.54914069 hartree
kineticenergy: 1160.07979698 hartree
xcener: -111.464119104942 hartree
chargesum: -0.0000000
charge: -0.260890 -0.248791 -0.333743 -0.356928 -0.113201 -0.031299 -0.300706 0.004853 -0.126601 -0.126100 0.275859 0.317239 -0.252417 0.203956 -0.023385 -0.132128 -0.199706 -0.047844 -0.118502 -0.002827 -0.186880 -0.020134 -0.077204 -0.173569 -0.211613 0.120496 0.074923 0.090168 0.137798 0.128299 0.082394 0.081137 0.102571 0.106253 0.121267 0.086064 0.092602 0.138987 0.080644 0.061930 0.157148 0.176101 0.142055 0.145460 0.130800 0.105481 0.100643 0.079340
qa: -0.2609 -0.2488 -0.3337 -0.3569 -0.1132 -0.0313 -0.3007 0.0049 -0.1266 -0.1261 0.2759 0.3172 -0.2524 0.2040 -0.0234 -0.1321 -0.1997 -0.0478 -0.1185 -0.0028 -0.1869 -0.0201 -0.0772 -0.1736 -0.2116 0.1205 0.0749 0.0902 0.1378 0.1283 0.0824 0.0811 0.1026 0.1063 0.1213 0.0861 0.0926 0.1390 0.0806 0.0619 0.1571 0.1761 0.1421 0.1455 0.1308 0.1055 0.1006 0.0793
va: 2.0935 2.3017 2.1580 2.1464 3.0157 3.2811 3.1088 3.9245 3.9202 3.9308 4.3046 4.2737 3.9343 3.4942 3.8526 3.8617 3.9612 3.8503 3.9195 3.9965 3.9233 3.8866 4.0328 3.8910 3.9760 0.9909 1.0095 1.0191 1.0326 0.9956 1.0044 1.0093 1.0082 0.9939 1.0068 1.0192 1.0246 1.0122 1.0186 1.0176 1.0084 1.0112 1.0043 1.0002 1.0068 1.0085 1.0093 1.0174
dispcorr: -0.028506803 hartree
energy: -1165.025876948761
dipole: 3.49793 -4.54444 -1.04651 -11.92576 11.47042 -0.45534 11.74594 -11.17642 0.56952
magnitude: 1.27549 au
magnitude: 3.24203 debye
