program: Orca
programVersion: 4.2.1
elementType: O O O O N N N C C C C C C C C C C C C C C C C C C H H H H H H H H H H H H H H H H H H H H H H H
charge: 0
multiplicity: 1
keywords: wb97x-d3
keywords: def2-TZVPP
keywords: def2/J RIJCOSX GRIDX6 NOFINALGRIDX
keywords: grid4 nofinalgrid
keywords: scfconv7
keywords: smallprint printgap noloewdin
keywords: NOSOSCF
formula: C18H23N3O4
InChI: InChI=1/C18H23N3O4/c1-3-5-6-11-25-17(22)16(4-2)21(13-15-8-7-12-24-15)18(23)20-10-9-19-14-20/h3,7-10,12,14,16H,1,4-6,11,13H2,2H3
48 atoms
O  0.613286 -1.323048 1.721563
O  -2.193438 -1.004381 -1.012176
O  -1.40128 -0.902937 2.602246
O  -0.46666 2.700955 -1.336447
N  -0.599576 1.186297 0.350304
N  1.477249 1.815776 -0.578219
N  3.469459 0.872541 -0.696314
C  -0.105246 0.924225 1.703301
C  -0.686818 1.881543 2.742674
C  -2.048561 1.122417 0.136722
C  -0.393179 -0.532877 2.06651
C  0.072753 1.958859 -0.55679
C  -0.373381 3.337932 2.433626
C  -2.394127 0.330923 -1.069011
C  0.487583 -2.736769 1.93336
C  -0.19242 -3.422569 0.765313
C  -2.887416 0.67024 -2.282258
C  0.551096 -3.276465 -0.565487
C  2.342076 2.78005 -1.049256
C  2.225011 0.679589 -0.401201
C  -3.002295 -0.543409 -3.02281
C  -2.561711 -1.520651 -2.199754
C  3.558732 2.181807 -1.093665
C  1.921831 -3.874579 -0.527183
C  3.058802 -3.214597 -0.706265
H  0.975316 1.06209 1.696355
H  -1.763553 1.736864 2.844119
H  -0.261438 1.612478 3.713108
H  -2.477958 2.121097 0.040998
H  -2.497642 0.663551 1.016936
H  0.698497 3.502927 2.309807
H  -0.869097 3.684704 1.526543
H  -0.708929 3.980346 3.24691
H  -0.051461 -2.929017 2.861855
H  1.512665 -3.08815 2.047305
H  -1.214998 -3.054419 0.664938
H  -0.273745 -4.483319 1.023464
H  -3.121585 1.667657 -2.613862
H  0.59955 -2.227063 -0.863292
H  -0.038318 -3.779794 -1.338396
H  2.009657 3.771392 -1.300506
H  1.793393 -0.250924 -0.071772
H  -3.357426 -0.66532 -4.032086
H  -2.457203 -2.586547 -2.315712
H  4.498619 2.616634 -1.392699
H  1.965005 -4.94184 -0.321708
H  4.014776 -3.718556 -0.660112
H  3.09015 -2.15271 -0.919628
totalener: -1164.99854538 hartree
nucrepener: 2379.98593612 hartree
electener: -3544.98448150 hartree
oneelecener: -6316.35024360 hartree
twoeener: 2771.36576210 hartree
kineticenergy: 1160.07378629 hartree
xcener: -111.459158555355 hartree
chargesum: -0.0000000
charge: -0.262521 -0.263569 -0.352615 -0.354179 -0.112145 -0.026891 -0.316387 -0.006367 -0.122552 -0.097462 0.332127 0.300677 -0.264457 0.163913 -0.035731 -0.135626 -0.212734 -0.081590 -0.118464 0.076616 -0.152542 -0.011155 -0.076419 -0.189830 -0.200856 0.121451 0.079701 0.085922 0.129924 0.138289 0.083417 0.083958 0.102138 0.113628 0.122167 0.099055 0.086364 0.140251 0.071836 0.085679 0.158751 0.107447 0.138395 0.136980 0.130705 0.106784 0.102767 0.095153
qa: -0.2625 -0.2636 -0.3526 -0.3542 -0.1121 -0.0269 -0.3164 -0.0064 -0.1226 -0.0975 0.3321 0.3007 -0.2645 0.1639 -0.0357 -0.1356 -0.2127 -0.0816 -0.1185 0.0766 -0.1525 -0.0112 -0.0764 -0.1898 -0.2009 0.1215 0.0797 0.0859 0.1299 0.1383 0.0834 0.0840 0.1021 0.1136 0.1222 0.0991 0.0864 0.1403 0.0718 0.0857 0.1588 0.1074 0.1384 0.1370 0.1307 0.1068 0.1028 0.0952
va: 2.1284 2.2838 2.1314 2.1467 2.9628 3.2726 3.1170 3.9782 3.8820 3.8697 4.1768 4.2769 3.9295 3.5163 3.8499 3.8351 4.0332 3.8696 3.9289 3.9821 3.9911 3.9076 4.0334 3.8599 3.9454 1.0084 1.0195 1.0115 1.0085 1.0193 1.0045 1.0104 1.0058 1.0144 0.9993 1.0323 1.0147 1.0152 1.0166 1.0129 1.0095 1.0422 1.0054 1.0035 1.0068 1.0069 1.0121 1.0250
dispcorr: -0.029198545 hartree
energy: -1165.027743926571
dipole: 1.74202 -2.27130 -0.52928 -6.93295 6.70509 -0.22786 6.39590 -5.77496 0.62094
magnitude: 0.84713 au
magnitude: 2.15323 debye
