program: Orca
programVersion: 4.2.1
elementType: O O O O N N N C C C C C C C C C C C C C C C C C C H H H H H H H H H H H H H H H H H H H H H H H
charge: 0
multiplicity: 1
keywords: wb97x-d3
keywords: def2-TZVPP
keywords: def2/J RIJCOSX GRIDX6 NOFINALGRIDX
keywords: grid4 nofinalgrid
keywords: scfconv7
keywords: smallprint printgap noloewdin
keywords: NOSOSCF
formula: C18H23N3O4
InChI: InChI=1/C18H23N3O4/c1-3-5-6-11-25-17(22)16(4-2)21(13-15-8-7-12-24-15)18(23)20-10-9-19-14-20/h3,7-10,12,14,16H,1,4-6,11,13H2,2H3
48 atoms
O  0.559184 -0.89546 1.121213
O  -3.260509 -0.028481 0.145625
O  -1.240709 -0.682955 2.448338
O  0.735839 0.739115 -1.948447
N  -0.284123 1.511466 -0.060847
N  2.051725 1.518127 -0.273046
N  3.668669 2.677449 0.679995
C  -0.283481 1.276518 1.385528
C  -1.305948 2.123044 2.131631
C  -1.575611 1.472795 -0.746895
C  -0.421031 -0.215977 1.711492
C  0.797241 1.198175 -0.835751
C  -1.096333 3.61612 1.926859
C  -2.266876 0.154501 -0.753392
C  0.69488 -2.300608 1.370349
C  0.288493 -3.115947 0.160952
C  -2.121773 -0.962047 -1.508193
C  1.163821 -2.869367 -1.066766
C  3.213653 0.81546 -0.486863
C  2.400035 2.642031 0.428163
C  -3.087767 -1.894987 -1.031229
C  -3.741707 -1.270093 -0.024559
C  4.187747 1.538406 0.123511
C  0.728885 -3.67392 -2.249534
C  0.441185 -3.166221 -3.441058
H  0.700424 1.556075 1.768207
H  -2.324012 1.831141 1.872325
H  -1.204943 1.88777 3.191989
H  -1.410041 1.796647 -1.772104
H  -2.223397 2.220571 -0.288263
H  -0.114074 3.933515 2.281568
H  -1.178088 3.911585 0.87997
H  -1.838475 4.186303 2.484186
H  0.106499 -2.584185 2.242905
H  1.750693 -2.454501 1.60401
H  -0.760115 -2.92264 -0.073217
H  0.350608 -4.170487 0.44869
H  -1.408395 -1.105477 -2.301933
H  2.199987 -3.127371 -0.815741
H  1.158288 -1.811299 -1.331888
H  3.228502 -0.112671 -1.030412
H  1.680141 3.404804 0.683174
H  -3.266508 -2.893518 -1.393633
H  -4.541378 -1.571532 0.630973
H  5.237789 1.30535 0.193872
H  0.651444 -4.748211 -2.10141
H  0.136203 -3.792741 -4.268229
H  0.515774 -2.102607 -3.635989
totalener: -1164.99659068 hartree
nucrepener: 2420.58266718 hartree
electener: -3585.57925787 hartree
oneelecener: -6397.50746729 hartree
twoeener: 2811.92820942 hartree
kineticenergy: 1160.07753995 hartree
xcener: -111.463692227195 hartree
chargesum: -0.0000000
charge: -0.253563 -0.248931 -0.328342 -0.366971 -0.121037 0.012491 -0.295037 0.000555 -0.059128 -0.117650 0.261927 0.299897 -0.281116 0.211948 -0.042763 -0.117027 -0.287290 -0.047677 -0.113366 -0.010704 -0.142724 -0.002170 -0.077678 -0.172793 -0.233829 0.117995 0.078852 0.085887 0.128801 0.128142 0.076282 0.082673 0.104840 0.115530 0.104004 0.086002 0.086648 0.157025 0.083040 0.056030 0.154421 0.163124 0.149907 0.137843 0.131502 0.100507 0.103122 0.100802
qa: -0.2536 -0.2489 -0.3283 -0.3670 -0.1210 0.0125 -0.2950 0.0006 -0.0591 -0.1176 0.2619 0.2999 -0.2811 0.2119 -0.0428 -0.1170 -0.2873 -0.0477 -0.1134 -0.0107 -0.1427 -0.0022 -0.0777 -0.1728 -0.2338 0.1180 0.0789 0.0859 0.1288 0.1281 0.0763 0.0827 0.1048 0.1155 0.1040 0.0860 0.0866 0.1570 0.0830 0.0560 0.1544 0.1631 0.1499 0.1378 0.1315 0.1005 0.1031 0.1008
va: 2.1315 2.3026 2.1673 2.1195 2.9862 3.2502 3.1393 3.9382 3.8469 3.9208 4.3191 4.2885 3.9394 3.3725 3.8833 3.8424 3.9633 3.8634 3.9349 4.0495 3.8995 3.9338 4.0377 3.8584 3.9626 1.0026 1.0260 1.0190 1.0131 0.9994 1.0027 1.0055 1.0085 1.0242 0.9963 1.0248 1.0171 1.0167 1.0086 1.0301 1.0040 0.9961 1.0023 1.0026 1.0074 1.0102 1.0117 1.0161
dispcorr: -0.031363540 hartree
energy: -1165.027954222906
dipole: -2.31489 1.54499 -0.76990 -7.07749 6.43185 -0.64564 -0.49949 0.74521 0.24573
magnitude: 1.03440 au
magnitude: 2.62922 debye
