program: Orca
programVersion: 4.2.1
elementType: O O O O N N N C C C C C C C C C C C C C C C C C C H H H H H H H H H H H H H H H H H H H H H H H
charge: 0
multiplicity: 1
keywords: wb97x-d3
keywords: def2-TZVPP
keywords: def2/J RIJCOSX GRIDX6 NOFINALGRIDX
keywords: grid4 nofinalgrid
keywords: scfconv7
keywords: smallprint printgap noloewdin
keywords: NOSOSCF
formula: C18H23N3O4
InChI: InChI=1/C18H23N3O4/c1-3-5-6-11-25-17(22)16(4-2)21(13-15-8-7-12-24-15)18(23)20-10-9-19-14-20/h3,7-10,12,14,16H,1,4-6,11,13H2,2H3
48 atoms
O  -0.010925 -1.071442 1.28654
O  -1.673994 -0.389708 -1.899438
O  -1.601444 -0.392565 2.704853
O  -0.01353 2.74985 -1.691035
N  -0.531289 1.497294 0.135742
N  1.704381 1.983726 -0.426811
N  3.678608 1.071458 -0.051682
C  -0.259538 1.253079 1.54772
C  -0.863676 2.313937 2.46687
C  -1.926657 1.397969 -0.28129
C  -0.723665 -0.154461 1.923689
C  0.326469 2.119106 -0.724128
C  -0.39369 3.718619 2.11965
C  -2.287685 0.046284 -0.781908
C  -0.324801 -2.451294 1.508878
C  0.732799 -3.287258 0.82206
C  -3.187325 -0.874898 -0.359093
C  0.739992 -3.161951 -0.7019
C  2.642744 2.958192 -0.682633
C  2.40176 0.859397 -0.066508
C  -3.121218 -1.953668 -1.291576
C  -2.18279 -1.598321 -2.198537
C  3.84291 2.379069 -0.423723
C  1.830636 -3.976139 -1.320187
C  1.643831 -5.017613 -2.119385
H  0.820655 1.280094 1.696292
H  -1.953987 2.26546 2.465054
H  -0.566715 2.067733 3.488427
H  -2.120017 2.153019 -1.043121
H  -2.57739 1.631586 0.561696
H  0.695788 3.787805 2.103541
H  -0.761417 4.04948 1.147903
H  -0.753672 4.434079 2.857972
H  -1.320395 -2.659928 1.108072
H  -0.343466 -2.656211 2.581549
H  0.552499 -4.330928 1.092239
H  1.716722 -3.036353 1.229978
H  -3.815714 -0.796647 0.512862
H  0.867496 -2.113385 -0.987038
H  -0.231289 -3.471612 -1.096329
H  2.366343 3.943378 -1.014107
H  1.913254 -0.078451 0.144332
H  -3.697876 -2.863461 -1.285367
H  -1.787317 -2.084005 -3.075186
H  4.820877 2.828077 -0.485941
H  2.846028 -3.678608 -1.072284
H  2.4743 -5.574205 -2.531568
H  0.651323 -5.353344 -2.395457
totalener: -1164.99850324 hartree
nucrepener: 2371.50989998 hartree
electener: -3536.50840322 hartree
oneelecener: -6299.00412468 hartree
twoeener: 2762.49572146 hartree
kineticenergy: 1160.08079777 hartree
xcener: -111.462514197948 hartree
chargesum: 0.0000000
charge: -0.254345 -0.248025 -0.330377 -0.354455 -0.122189 -0.028036 -0.298301 -0.026466 -0.119602 -0.090140 0.301673 0.314468 -0.261866 0.255096 -0.045445 -0.110395 -0.310495 -0.049260 -0.119125 0.021783 -0.132056 -0.054615 -0.076707 -0.165197 -0.217182 0.126565 0.075502 0.083724 0.134308 0.137280 0.084121 0.084604 0.101849 0.108847 0.121235 0.084950 0.079177 0.147357 0.088293 0.048512 0.157085 0.139528 0.141408 0.151347 0.130454 0.112628 0.104032 0.078450
qa: -0.2543 -0.2480 -0.3304 -0.3545 -0.1222 -0.0280 -0.2983 -0.0265 -0.1196 -0.0901 0.3017 0.3145 -0.2619 0.2551 -0.0454 -0.1104 -0.3105 -0.0493 -0.1191 0.0218 -0.1321 -0.0546 -0.0767 -0.1652 -0.2172 0.1266 0.0755 0.0837 0.1343 0.1373 0.0841 0.0846 0.1018 0.1088 0.1212 0.0849 0.0792 0.1474 0.0883 0.0485 0.1571 0.1395 0.1414 0.1513 0.1305 0.1126 0.1040 0.0785
va: 2.1126 2.3009 2.1601 2.1464 3.0218 3.2585 3.1386 3.9690 3.9043 3.8734 4.2446 4.2805 3.9401 3.4109 3.8727 3.8631 3.9804 3.8362 3.9208 4.0234 3.8744 3.9155 4.0291 3.8647 3.9724 0.9961 1.0176 1.0179 1.0272 0.9971 1.0035 1.0070 1.0081 0.9955 1.0095 1.0200 1.0192 1.0152 1.0089 1.0353 1.0089 1.0243 1.0049 0.9989 1.0077 1.0077 1.0095 1.0168
dispcorr: -0.029299165 hartree
energy: -1165.027802404854
dipole: -0.31539 -0.57849 -0.89388 -9.74364 9.33952 -0.40412 5.57906 -4.91877 0.66028
magnitude: 1.18250 au
magnitude: 3.00567 debye
