program: Orca
programVersion: 4.2.1
elementType: O O O O N N N C C C C C C C C C C C C C C C C C C H H H H H H H H H H H H H H H H H H H H H H H
charge: 0
multiplicity: 1
keywords: wb97x-d3
keywords: def2-TZVPP
keywords: def2/J RIJCOSX GRIDX6 NOFINALGRIDX
keywords: grid4 nofinalgrid
keywords: scfconv7
keywords: smallprint printgap noloewdin
keywords: NOSOSCF
formula: C18H23N3O4
InChI: InChI=1/C18H23N3O4/c1-3-5-6-11-25-17(22)16(4-2)21(13-15-8-7-12-24-15)18(23)20-10-9-19-14-20/h3,7-10,12,14,16H,1,4-6,11,13H2,2H3
48 atoms
O  0.463412 -1.048147 0.279817
O  -1.968304 -0.087583 -1.799853
O  -0.370407 -0.850848 2.349027
O  -0.469359 3.273293 -1.569295
N  -0.364632 1.635745 0.007544
N  1.571665 2.426436 -1.077836
N  3.587869 3.194809 -1.536892
C  0.349193 1.130765 1.17353
C  0.039515 1.915447 2.448791
C  -1.817298 1.499429 0.021693
C  0.089227 -0.365435 1.353605
C  0.167453 2.490827 -0.911899
C  0.300916 3.40572 2.29114
C  -2.271447 0.19165 -0.517921
C  0.212949 -2.458569 0.254749
C  1.289331 -3.251364 0.971739
C  -2.970712 -0.833241 0.026822
C  1.066105 -4.756958 0.805725
C  2.397633 1.32492 -1.176171
C  2.352391 3.520557 -1.328415
C  -3.104686 -1.81432 -1.000982
C  -2.471776 -1.30305 -2.081258
C  3.627406 1.829197 -1.456683
C  -0.218663 -5.225574 1.413342
C  -1.194473 -5.839498 0.757612
H  1.419712 1.237191 0.988329
H  -0.985053 1.741205 2.782028
H  0.671694 1.511919 3.2418
H  -2.247179 2.322712 -0.54807
H  -2.190425 1.598644 1.042022
H  1.312425 3.602321 1.929992
H  -0.395742 3.877194 1.597178
H  0.193622 3.914997 3.248132
H  0.188625 -2.716599 -0.804518
H  -0.774752 -2.666759 0.66658
H  1.296953 -2.997152 2.034001
H  2.270909 -2.986614 0.570886
H  -3.33429 -0.890327 1.039687
H  1.900492 -5.280795 1.281132
H  1.097064 -5.027272 -0.253835
H  2.032845 0.317683 -1.078587
H  1.94635 4.519769 -1.329665
H  -3.598932 -2.769097 -0.936547
H  -2.311383 -1.671331 -3.080912
H  4.542094 1.28101 -1.616216
H  -0.341839 -5.02554 2.474621
H  -2.10203 -6.15425 1.25439
H  -1.121708 -6.055451 -0.301668
totalener: -1164.99748378 hartree
nucrepener: 2342.40946753 hartree
electener: -3507.40695131 hartree
oneelecener: -6240.83413073 hartree
twoeener: 2733.42717942 hartree
kineticenergy: 1160.08391359 hartree
xcener: -111.465308775249 hartree
chargesum: 0.0000000
charge: -0.265941 -0.249818 -0.336078 -0.357791 -0.117665 -0.032360 -0.298467 -0.031212 -0.122021 -0.094527 0.314398 0.314396 -0.261792 0.228803 0.007565 -0.133698 -0.269668 -0.086324 -0.179628 0.053361 -0.161530 -0.026277 -0.072711 -0.165240 -0.217432 0.122115 0.073509 0.085367 0.134905 0.134358 0.084937 0.085239 0.102012 0.103711 0.117381 0.091375 0.077829 0.144438 0.088465 0.068158 0.183408 0.145105 0.139312 0.144437 0.129189 0.116734 0.106497 0.083173
qa: -0.2659 -0.2498 -0.3361 -0.3578 -0.1177 -0.0324 -0.2985 -0.0312 -0.1220 -0.0945 0.3144 0.3144 -0.2618 0.2288 0.0076 -0.1337 -0.2697 -0.0863 -0.1796 0.0534 -0.1615 -0.0263 -0.0727 -0.1652 -0.2174 0.1221 0.0735 0.0854 0.1349 0.1344 0.0849 0.0852 0.1020 0.1037 0.1174 0.0914 0.0778 0.1444 0.0885 0.0682 0.1834 0.1451 0.1393 0.1444 0.1292 0.1167 0.1065 0.0832
va: 2.1121 2.3035 2.1560 2.1448 3.0166 3.2582 3.1362 3.9538 3.9075 3.8842 4.2620 4.2890 3.9412 3.4604 3.7967 3.8864 3.9546 3.9081 3.8808 4.0387 3.9087 3.9025 4.0611 3.8334 3.9575 0.9934 1.0160 1.0180 1.0285 0.9952 1.0042 1.0058 1.0088 1.0025 1.0070 1.0199 1.0172 1.0128 1.0079 1.0140 1.0087 1.0082 1.0061 1.0007 1.0101 1.0061 1.0085 1.0146
dispcorr: -0.028277514 hartree
energy: -1165.025761296967
dipole: -0.70715 0.07761 -0.62954 -17.20063 15.57675 -1.62388 13.13891 -12.28275 0.85615
magnitude: 1.94069 au
magnitude: 4.93285 debye
