program: Gaussian 09
title: 000068371
version: EM64L-G09RevD.01
frameworkgroup: C1[X(C10H13NO2)]
method: RPBEPBE
basis: SDD
operation: Freq
keyword: #p
keyword: freq=noraman
keyword: PBEPBE/SDD
title: #p freq=noraman PBEPBE/SDD
converged: YES YES NO NO
title: Mulliken charges:
elementType: O O N C C C C C C C C C C H H H H H H H H H H H H H
charge: -0.250179 -0.408024 -0.376983 -0.015979 -0.704870 -0.669386 0.160634 0.157010 0.146945 -0.355142 -0.391291 -0.251011 -0.198405 0.244582 0.305033 0.223025 0.200687 0.230274 0.260174 0.207882 0.195729 0.252954 0.219539 0.231115 0.229464 0.356223
chargesum: 0.00000
title: Mulliken charges with hydrogens summed into heavy atoms:
elementType: O O N C C C C C C C C C C
charge: -0.250179 -0.051802 -0.071951 0.228603 -0.050884 -0.005601 0.160634 0.157010 0.146945 -0.102188 -0.171752 -0.019895 0.031059
polarizability: 1.59302025e+02 -3.31445457e+00 1.27548285e+02 -6.81855550e+00 -4.98612360e-01 7.63460566e+01
1716.lowfreq: -8.7666 0.0008 0.0009 0.0010 1.6866 9.1966 25.8210 43.6214 73.9650
frequency: 25.5981 43.5999 73.9391 79.3712 164.3860 188.2287 207.6548 221.1746 248.7555 256.5407 337.4235 340.8175 377.6301 408.9973 430.5917 456.9753 489.6800 532.4393 551.1658 569.2115 644.5514 702.9250 752.5677 755.0241 782.5094 834.1613 847.2582 857.7899 918.1929 934.1645 941.1737 953.2362 975.0768 1037.6023 1066.9340 1120.7668 1142.1940 1152.6338 1159.7972 1172.5353 1182.7096 1249.5229 1252.9790 1290.1731 1314.5110 1349.4743 1375.6596 1388.5501 1392.6659 1427.9266 1453.4015 1464.2638 1467.7123 1482.1280 1485.8214 1491.8359 1587.6698 1608.7346 1609.8864 2973.1315 2979.6602 3025.3272 3066.2561 3078.5589 3089.8195 3098.1353 3113.3166 3131.5634 3145.3033 3167.7953 3534.6980 3576.9313
redmass: 3.3425 4.4344 4.1054 3.9057 4.0843 5.3912 1.1042 2.4929 1.9721 1.9349 1.1964 2.8179 3.4118 3.1045 3.9066 2.9606 3.0688 4.5634 1.3105 3.7671 6.0751 4.9106 4.3136 1.3816 5.5168 3.1258 1.7612 2.6187 1.2670 1.5453 1.4347 1.7972 1.3250 2.3288 2.5498 2.0558 2.1711 1.3031 1.9532 1.0573 2.2874 2.5927 2.0315 1.4338 1.6231 1.2939 1.2150 7.3883 1.2366 2.3220 1.5035 1.1255 1.0485 1.1797 1.0595 2.5194 6.8653 6.7771 7.4001 1.0378 1.0364 1.0848 1.0979 1.0985 1.0998 1.1000 1.0885 1.0876 1.0931 1.1005 1.0776 1.0660
irintensity: 0.3282 5.7874 1.8360 2.9083 0.4367 1.9080 0.1758 5.7734 2.2309 3.6123 122.7250 8.3123 6.6845 2.2693 11.0324 8.0761 18.9243 16.4228 65.1479 4.7258 12.2996 11.8245 7.0470 85.6896 11.5369 17.0914 4.6805 2.6403 2.8144 10.7200 1.1399 6.2769 0.0381 5.0339 71.3688 47.7948 18.8239 32.2340 16.9303 2.7511 92.6647 17.4870 70.4084 46.7916 23.3214 12.2038 24.6315 12.5913 30.6105 35.5082 219.5072 39.5069 3.2961 31.0026 22.4169 39.1619 63.4056 22.0548 149.2792 24.6980 32.3105 0.5908 11.3653 70.0751 34.7159 25.4820 13.3654 1.7295 20.0846 21.5405 15.0234 33.2476
temp: 298.150 k
press: 1.00000 atm
elementType: 8 8 7 6 6 6 6 6 6 6 6 6 6 1 1 1 1 1 1 1 1 1 1 1 1 1
symmnumber: 1
zpe: 553939.2 jmol-1
zpe.correction: 0.210984 hartree
zpe.thermalcorrener: 0.224329 hartree
zpe.thermalcorrenthalpy: 0.225273 hartree
zpe.thermalcorrgfe: 0.170178 hartree
zpe.sumelectzpe: -593.099266 hartree
zpe.sumelectthermal: -593.085922 hartree
zpe.sumelectthermalent: -593.084977 hartree
zpe.sumelectthermalfe: -593.140072 hartree
dipole: 1.2623 -1.9552 -3.3049
dipole: 4.0421
quadrupole: -59.6785 -71.3814 -83.7215
quadrupole: 7.5413 -0.6094 -4.9312
quadrupole: 11.9153 0.2124 -12.1277 7.5413 -0.6094 -4.9312
hfenergy: -593.3102501 hartree
pointgroup: C01 [X(C10H13N1O2)]
dipole: -0.4891899 0.9905815 -1.143886 debye
dipolederiv: -0.7798026 0.150723 -0.0793458 -0.0693964 -0.671799 0.3453604 0.1681855 0.3014273 -0.6126075 -0.0951038 0.2595264 0.1344676 0.1401499 -1.1951103 -0.2462162 0.1101235 -0.265236 -0.4428904 -1.1850951 -0.2281017 0.2932531 -0.3520054 -0.622485 0.0682954 0.2691584 -0.0165987 -0.426458 0.7546358 0.0103282 -0.0894339 -0.1217173 0.2896037 0.0981964 0.0729564 0.1398506 0.1932157 -0.0906331 -0.0462405 0.0268213 -0.0359768 -0.0551357 -0.0351657 0.0038906 -0.045267 0.1080094 -0.0853694 -0.044158 0.047893 0.0131552 -0.0953319 -0.0944086 0.0147708 -0.1182901 0.0343215 1.6285596 0.0783366 -0.1402244 0.3576757 0.785063 -0.6268057 -0.422828 -0.5039263 0.672453 -0.2599296 -0.0915806 -0.0606855 0.1845153 -0.2477714 0.0156216 0.0630985 -0.031223 -0.1030726 0.0914956 -0.2573727 -0.0760211 -0.0676156 1.1180675 0.3434255 -0.0742672 0.3252498 0.1734436 0.0784258 -0.0026355 0.0614465 -0.2008094 0.0838406 0.0498699 0.0907896 0.0653698 -0.0845815 -0.0741473 0.3189493 0.1435937 -0.0230225 -0.2234758 -0.0099583 0.0380505 0.0477109 -0.1689642 -0.2852274 -0.0494445 -0.0216077 -0.0684117 -0.0059584 0.037757 -0.0460982 0.0439911 -0.1788744 0.1166902 -0.0487527 0.042591 0.1256203 0.1178172 0.0990089 0.0900987 0.0724812 -0.090435 0.0429405 -0.0150622 0.0286236 0.0550105 0.0322229 0.0397769 -0.0439667 0.0142038 -0.074097 0.159539 0.0158564 0.0061054 0.0751055 0.198705 0.0865164 -0.0610994 0.1106409 0.1726268 -0.1915568 0.0038834 -0.0245309 0.0420851 0.0775983 0.0235587 -0.0211102 0.0159987 0.0955995 0.0850744 0.0183136 -0.0627612 -0.0232026 0.0325219 0.0537603 -0.0143475 0.1149451 -0.137709 0.0982643 0.0666928 0.0625158 0.0306179 -0.0598208 -0.1092196 0.0466542 -0.117685 -0.0193671 0.0703208 -0.1132582 -0.000884 -0.1002264 -0.0555456 -0.0111386 -0.0068196 0.014548 0.0824672 -0.2115675 0.0732505 -0.0154369 0.0848985 0.0937969 -0.0184734 -0.0263812 0.0073344 0.0640404 0.0956118 0.0301351 -0.0324005 0.0113024 0.0331186 0.1108058 0.00604 0.0409387 -0.1412635 0.0169591 -0.0863806 -0.0651045 -0.0751648 0.0345133 -0.0458472 -0.0734307 -0.0444752 0.1060136 0.0013209 -0.0606697 -0.057416 -0.0968954 -0.0315306 -0.0876703 -0.0743794 -0.0852538 0.1270211 0.0569198 0.0534677 -0.0072532 0.0757212 -0.0847162 -0.0667589 -0.0068381 -0.0705023 0.1476088 -0.1054901 0.0656609 -0.0364932 0.0603466 0.0777646 -0.0129424 -0.0390739 -0.0063952 0.1459179 0.0671651 -0.1014671 -0.0777122 -0.0217599 0.3740472 -0.0073482 -0.0631767 -0.0098378 0.3575815 unknown
polarizability: 159.2385068|-4.9073289|125.9903886|5.7080023|9.1417001|77.967471 unknown
InChI: InChI=1S/C10H13NO2/c1-7(2)11-10(13)8-5-3-4-6-9(8)12/h3-7,11-12H,1-2H3
charge 0 multiplicity 1
26 atoms
O  0.949502 -1.317182 1.263509
O  -1.288241 -2.067167 -0.66322
N  1.656239 0.433463 -0.101454
C  3.100189 0.153959 0.074882
C  3.9013 1.464681 -0.050801
C  3.577684 -0.928513 -0.922844
C  0.674879 -0.343653 0.498782
C  -0.739157 0.112493 0.20922
C  -1.716703 -0.783079 -0.303875
C  -1.136702 1.435365 0.525003
C  -3.057535 -0.361669 -0.478284
C  -2.47246 1.864765 0.354851
C  -3.433603 0.957609 -0.144733
H  3.202589 -0.252997 1.097766
H  1.37494 1.130966 -0.794439
H  4.975938 1.271507 0.114015
H  3.794205 1.904598 -1.062031
H  3.5655 2.210232 0.691943
H  2.973611 -1.843932 -0.804398
H  4.637614 -1.183989 -0.739352
H  3.482819 -0.573656 -1.966509
H  -0.391165 2.124456 0.938141
H  -3.803185 -1.060899 -0.879273
H  -2.759988 2.887543 0.61833
H  -4.474224 1.27279 -0.277689
H  -2.050546 -2.62279 -0.96244
