program: Orca
programVersion: 4.2.1
elementType: O O O O N N N C C C C C C C C C C C C C C C C C C H H H H H H H H H H H H H H H H H H H H H H H
charge: 0
multiplicity: 1
keywords: wb97x-d3
keywords: def2-TZVPP
keywords: def2/J RIJCOSX GRIDX6 NOFINALGRIDX
keywords: grid4 nofinalgrid
keywords: scfconv7
keywords: smallprint printgap noloewdin
keywords: NOSOSCF
formula: C18H23N3O4
InChI: InChI=1/C18H23N3O4/c1-3-5-6-11-25-17(22)16(4-2)21(13-15-8-7-12-24-15)18(23)20-10-9-19-14-20/h3,7-10,12,14,16H,1,4-6,11,13H2,2H3
48 atoms
O  0.162456 -2.681078 0.606684
O  -3.925499 0.493739 0.053559
O  0.214254 -1.881052 -1.481388
O  -0.408659 2.650574 -1.583351
N  -0.604679 0.589229 -0.668325
N  1.449152 1.74338 -0.641459
N  3.597654 1.244511 -0.622413
C  -0.199009 -0.364236 0.346099
C  -1.137071 -0.402672 1.558395
C  -1.913229 0.428349 -1.303299
C  0.063647 -1.72127 -0.300654
C  0.075831 1.712997 -1.000426
C  -1.259606 0.952965 2.237994
C  -3.038821 1.194299 -0.692654
C  0.66996 -3.954146 0.191847
C  2.17884 -3.950784 0.037181
C  -3.410008 2.498092 -0.731299
C  2.974826 -3.668364 1.316168
C  2.104749 2.854133 -0.163405
C  2.412887 0.81109 -0.918361
C  -4.595884 2.602714 0.052346
C  -4.856753 1.354243 0.501212
C  3.419597 2.512749 -0.139785
C  2.735017 -2.316821 1.928456
C  3.448737 -1.231726 1.654604
H  0.777014 -0.055853 0.733588
H  -2.121372 -0.782781 1.28184
H  -0.726297 -1.120596 2.268738
H  -2.158997 -0.63362 -1.302204
H  -1.810951 0.71291 -2.349916
H  -1.869678 0.871065 3.136733
H  -0.281125 1.331765 2.541079
H  -1.723127 1.704191 1.599323
H  0.190127 -4.264739 -0.737768
H  0.362985 -4.643063 0.979791
H  2.471629 -3.246142 -0.743957
H  2.457219 -4.94195 -0.334083
H  -2.894815 3.286363 -1.251646
H  4.0353 -3.766513 1.072977
H  2.757192 -4.446884 2.053578
H  1.581185 3.753502 0.109277
H  2.17881 -0.14353 -1.36319
H  -5.175048 3.48938 0.248574
H  -5.641528 0.942087 1.113289
H  4.251772 3.111074 0.194139
H  1.919715 -2.240556 2.640555
H  3.236487 -0.277959 2.119168
H  4.272263 -1.239806 0.951323
totalener: -1164.99717536 hartree
nucrepener: 2356.20201372 hartree
electener: -3521.19918908 hartree
oneelecener: -6268.95654569 hartree
twoeener: 2747.75735661 hartree
kineticenergy: 1160.06623284 hartree
xcener: -111.462707182125 hartree
chargesum: -0.0000000
charge: -0.268731 -0.260313 -0.354509 -0.379289 -0.086088 -0.027024 -0.307632 0.026579 -0.117838 -0.076043 0.294514 0.337009 -0.272901 0.132404 -0.013574 -0.133515 -0.205888 -0.103142 -0.112402 0.001076 -0.137763 -0.027359 -0.081482 -0.136618 -0.246319 0.089357 0.086842 0.088746 0.119932 0.129382 0.098913 0.086061 0.094025 0.110730 0.102581 0.092562 0.082162 0.156474 0.088632 0.075322 0.155072 0.169887 0.139485 0.140207 0.129551 0.109101 0.107503 0.104319
qa: -0.2687 -0.2603 -0.3545 -0.3793 -0.0861 -0.0270 -0.3076 0.0266 -0.1178 -0.0760 0.2945 0.3370 -0.2729 0.1324 -0.0136 -0.1335 -0.2059 -0.1031 -0.1124 0.0011 -0.1378 -0.0274 -0.0815 -0.1366 -0.2463 0.0894 0.0868 0.0887 0.1199 0.1294 0.0989 0.0861 0.0940 0.1107 0.1026 0.0926 0.0822 0.1565 0.0886 0.0753 0.1551 0.1699 0.1395 0.1402 0.1296 0.1091 0.1075 0.1043
va: 2.1357 2.2806 2.1213 2.1230 3.0943 3.2752 3.0776 3.9605 3.8300 3.9053 4.2020 4.2586 3.9331 3.4707 3.8809 3.8656 3.9963 3.8972 3.9101 3.9906 3.9494 3.9038 4.0121 3.7843 3.9371 1.0197 1.0267 1.0251 1.0147 1.0066 1.0073 1.0047 1.0110 1.0125 0.9946 1.0214 1.0151 1.0199 1.0112 1.0107 1.0089 1.0106 1.0041 1.0031 1.0071 1.0040 1.0076 1.0236
dispcorr: -0.030082019 hartree
energy: -1165.027257383626
dipole: 5.60779 -6.54155 -0.93376 -12.22823 11.11250 -1.11573 13.70854 -12.42274 1.28579
magnitude: 1.94165 au
magnitude: 4.93529 debye
